{"text_format":"1","workbook":"xlsx","n_sheets":4,"sheets":["Zał.1_WPF_bazowy","definicja","DaneZrodlowe","DaneZrodloweDoWsk"],"not_rendered":{"charts":0,"images":0,"macros":1,"external_links":0,"defined_names":7,"comments":0,"pivot_tables":0},"unopened":[],"bounds":{"document_bytes":16777216,"sheet_cells":100000,"rows_first":2000,"rows_last":500,"rows_between":2000,"halvings":0,"cell_chars":16384,"cell_head_chars":4096},"cells_cut":0,"cells_raw":0,"read":"whole","date_system":"1900"}

{"sheet":"Zał.1_WPF_bazowy","index":0,"n_rows":323,"n_cols":19,"rows_kept":323,"cut":false,"hidden":false,"merged":[[99,17,99,18],[1,4,1,5],[1,1,1,3],[1,9,1,11],[98,17,98,18]]}
[]
[null,"WIELOLETNIA PROGNOZA FINANSOWA GMINY MIASTO BRZEZINY NA LATA 2013-2023",null,null,"Wykonanie ",null,"Plan 3 kw.","Wykonanie ",{"$f":"RT_WstawParametr_tytul()","v":{"$error":"#NAME?"}},"Załącznik nr 1 do Uchwały Nr XLIII/203/2013                       Rady Miasta Brzeziny z 31 października 2013 r."]
["X","Lp.",null,"Wyszczególnienie",{"$f":"+F3-1","v":2010},{"$f":"+G3-1","v":2011},{"$f":"DaneZrodlowe!$A$4-1","v":2012},{"$f":"+DaneZrodlowe!$A$4-1","v":2012},{"$f":"+DaneZrodlowe!$N$1","v":2013},{"$f":"+I3+1","v":2014},{"$f":"+J3+1","v":2015},2016,2017,2018,2019,2020,2021,2022,2023]
["x",1,"Dochody ogółem","Dochody ogółem",{"$f":"31484876.01","v":31484876.010000002},{"$f":"31063442.33","v":31063442.329999998},{"$f":"35624119.93","v":35624119.93},{"$f":"34438420.27","v":34438420.270000003},{"$f":"37144207.17","v":37144207.170000002},{"$f":"31500000.71","v":31500000.710000001},{"$f":"31500000","v":31500000},{"$f":"31500000","v":31500000},{"$f":"32000000","v":32000000},{"$f":"32500000","v":32500000},{"$f":"33000000","v":33000000},{"$f":"33500000","v":33500000},{"$f":"34000000","v":34000000},{"$f":"34500000","v":34500000},{"$f":"35000000","v":35000000}]
["x","1.1","Dochody bieżące","Dochody bieżące, w tym:",{"$f":"25893786.18","v":25893786.18},{"$f":"28412491.19","v":28412491.190000001},{"$f":"29915724.45","v":29915724.449999999},{"$f":"29417886.46","v":29417886.460000001},{"$f":"32469863.81","v":32469863.809999999},{"$f":"31500000.71","v":31500000.710000001},{"$f":"31500000","v":31500000},{"$f":"31500000","v":31500000},{"$f":"32000000","v":32000000},{"$f":"32500000","v":32500000},{"$f":"33000000","v":33000000},{"$f":"33500000","v":33500000},{"$f":"34000000","v":34000000},{"$f":"34500000","v":34500000},{"$f":"35000000","v":35000000}]
[null,"1.1.1","dochody z tytułu udziału we wpływach z podatku dochodowego od osób fizycznych","dochody z tytułu udziału we wpływach z podatku dochodowego od osób fizycznych",{"$f":"0","v":0},{"$f":"0","v":0},{"$f":"0","v":0},{"$f":"0","v":0},{"$f":"6700000","v":6700000},{"$f":"7000000","v":7000000},{"$f":"7300000","v":7300000},{"$f":"7600000","v":7600000},{"$f":"7900000","v":7900000},{"$f":"8200000","v":8200000},{"$f":"8500000","v":8500000},{"$f":"8800000","v":8800000},{"$f":"9100000","v":9100000},{"$f":"9400000","v":9400000},{"$f":"9700000","v":9700000}]
[null,"1.1.2","dochody z tytułu udziału we wpływach z podatku dochodowego od osób prawnych","dochody z tytułu udziału we wpływach z podatku dochodowego od osób prawnych",{"$f":"0","v":0},{"$f":"0","v":0},{"$f":"0","v":0},{"$f":"0","v":0},{"$f":"120000","v":120000},{"$f":"120000","v":120000},{"$f":"125000","v":125000},{"$f":"130000","v":130000},{"$f":"140000","v":140000},{"$f":"150000","v":150000},{"$f":"160000","v":160000},{"$f":"170000","v":170000},{"$f":"180000","v":180000},{"$f":"190000","v":190000},{"$f":"200000","v":200000}]
[null,"1.1.3","podatki i opłaty, w tym:","podatki i opłaty, w tym:",{"$f":"0","v":0},{"$f":"0","v":0},{"$f":"0","v":0},{"$f":"0","v":0},{"$f":"5853743.3","v":5853743.2999999998},{"$f":"6300000","v":6300000},{"$f":"6450000","v":6450000},{"$f":"6600000","v":6600000},{"$f":"6750000","v":6750000},{"$f":"6900000","v":6900000},{"$f":"7050000","v":7050000},{"$f":"7200000","v":7200000},{"$f":"7350000","v":7350000},{"$f":"7500000","v":7500000},{"$f":"7650000","v":7650000}]
[null,"1.1.3.1","z podatku od nieruchomości","z podatku od nieruchomości",{"$f":"0","v":0},{"$f":"0","v":0},{"$f":"0","v":0},{"$f":"0","v":0},{"$f":"3722743.3","v":3722743.3},{"$f":"3900000","v":3900000},{"$f":"4100000","v":4100000},{"$f":"4300000","v":4300000},{"$f":"4500000","v":4500000},{"$f":"4700000","v":4700000},{"$f":"4900000","v":4900000},{"$f":"5100000","v":5100000},{"$f":"5300000","v":5300000},{"$f":"5500000","v":5500000},{"$f":"5700000","v":5700000}]
[null,"1.1.4","z subwencji ogólnej","z subwencji ogólnej",{"$f":"0","v":0},{"$f":"0","v":0},{"$f":"0","v":0},{"$f":"0","v":0},{"$f":"7466452","v":7466452},{"$f":"8000000","v":8000000},{"$f":"7750000","v":7750000},{"$f":"7900000","v":7900000},{"$f":"8050000","v":8050000},{"$f":"8200000","v":8200000},{"$f":"8350000","v":8350000},{"$f":"8500000","v":8500000},{"$f":"8700000","v":8700000},{"$f":"8900000","v":8900000},{"$f":"9100000","v":9100000}]
[null,"1.1.5","z tytułu dotacji i środków przeznaczonych na cele bieżące","z tytułu dotacji i środków przeznaczonych na cele bieżące",{"$f":"0","v":0},{"$f":"0","v":0},{"$f":"0","v":0},{"$f":"0","v":0},{"$f":"8401953.51","v":8401953.5099999998},{"$f":"6000000","v":6000000},{"$f":"6100000","v":6100000},{"$f":"6200000","v":6200000},{"$f":"6300000","v":6300000},{"$f":"6400000","v":6400000},{"$f":"6500000","v":6500000},{"$f":"6600000","v":6600000},{"$f":"6700000","v":6700000},{"$f":"6800000","v":6800000},{"$f":"6900000","v":6900000}]
["x","1.2","Dochody majątkowe","Dochody majątkowe, w tym:",{"$f":"5591089.83","v":5591089.8300000001},{"$f":"2650951.14","v":2650951.14},{"$f":"5708395.48","v":5708395.4800000004},{"$f":"5020533.81","v":5020533.8099999996},{"$f":"4674343.36","v":4674343.3600000003},{"$f":"0","v":0},{"$f":"0","v":0},{"$f":"0","v":0},{"$f":"0","v":0},{"$f":"0","v":0},{"$f":"0","v":0},{"$f":"0","v":0},{"$f":"0","v":0},{"$f":"0","v":0},{"$f":"0","v":0}]
["x","1.2.1","Dochody ze sprzedaży majątku","ze sprzedaży majątku",{"$f":"1337141.05","v":1337141.05},{"$f":"26005.76","v":26005.759999999998},{"$f":"100000","v":100000},{"$f":"159888.32","v":159888.32000000001},{"$f":"125000","v":125000},{"$f":"0","v":0},{"$f":"0","v":0},{"$f":"0","v":0},{"$f":"0","v":0},{"$f":"0","v":0},{"$f":"0","v":0},{"$f":"0","v":0},{"$f":"0","v":0},{"$f":"0","v":0},{"$f":"0","v":0}]
[null,"1.2.2","z tytułu dotacji oraz środków przeznaczonych na inwestycje","z tytułu dotacji oraz środków przeznaczonych na inwestycje",{"$f":"0","v":0},{"$f":"0","v":0},{"$f":"0","v":0},{"$f":"0","v":0},{"$f":"4381623.36","v":4381623.3600000003},{"$f":"0","v":0},{"$f":"0","v":0},{"$f":"0","v":0},{"$f":"0","v":0},{"$f":"0","v":0},{"$f":"0","v":0},{"$f":"0","v":0},{"$f":"0","v":0},{"$f":"0","v":0},{"$f":"0","v":0}]
["x",2,"Wydatki ogółem","Wydatki ogółem",{"$f":"34609335.7","v":34609335.700000003},{"$f":"31037203.93","v":31037203.93},{"$f":"40495660.86","v":40495660.859999999},{"$f":"36384626.19","v":36384626.189999998},{"$f":"39751618.39","v":39751618.390000001},{"$f":"30561940.55","v":30561940.550000001},{"$f":"30284308","v":30284308},{"$f":"29934304","v":29934304},{"$f":"30084300","v":30084300},{"$f":"30821796","v":30821796},{"$f":"31389996","v":31389996},{"$f":"31889996","v":31889996},{"$f":"32389996","v":32389996},{"$f":"32849996","v":32849996},{"$f":"33290000","v":33290000}]
["x","2.1","Wydatki bieżące","Wydatki bieżące, w tym:",{"$f":"25207681.97","v":25207681.969999999},{"$f":"26129253.64","v":26129253.640000001},{"$f":"29218500.44","v":29218500.440000001},{"$f":"26785030.3","v":26785030.300000001},{"$f":"31342902.25","v":31342902.25},{"$f":"26878935.15","v":26878935.149999999},{"$f":"27150000","v":27150000},{"$f":"27420000","v":27420000},{"$f":"27790000","v":27790000},{"$f":"28230000","v":28230000},{"$f":"28670000","v":28670000},{"$f":"29140000","v":29140000},{"$f":"29610000","v":29610000},{"$f":"30060000","v":30060000},{"$f":"30560000","v":30560000}]
["x","2.1.1","z tytułu poręczeń i gwarancji","z tytułu poręczeń i gwarancji, w tym:",{"$f":"0","v":0},{"$f":"0","v":0},{"$f":"0","v":0},{"$f":"0","v":0},{"$f":"0","v":0},{"$f":"110000","v":110000},110000,110000,110000,110000,110000,110000,{"$f":"101000","v":101000},{"$f":"59000","v":59000},{"$f":"59000","v":59000}]
["x","2.1.1.1","gwarancje i poręczenia podlegające wyłączeniu z limitów spłaty zobowiązań określonych w art. 243 ust. 3 pkt 2 ustawy z dnia 27 sierpnia 2009 r. o finansach publicznych (Dz. U. Nr 157, poz. 1240, z późn. zm.) lub art. 169 ust. 3 pkt 2 ustawy z dnia 30 czerwca 2005 r. o finansach publicznych (Dz. U. Nr 249, poz. 2104, z późn. zm)","gwarancje i poręczenia podlegające wyłączeniu z limitów spłaty zobowiązań określonych w art. 243 ust. 3 pkt 2 ustawy z dnia 27 sierpnia 2009 r. o finansach publicznych (Dz. U. Nr 157, poz. 1240, z późn. zm.) lub art. 169 ust. 3 pkt 2 ustawy z dnia 30 czerwca 2005 r. o finansach publicznych (Dz. U. Nr 249, poz. 2104, z późn. zm)",{"$f":"0","v":0},{"$f":"0","v":0},{"$f":"0","v":0},{"$f":"0","v":0},{"$f":"0","v":0},{"$f":"0","v":0},{"$f":"0","v":0},{"$f":"0","v":0},{"$f":"0","v":0},{"$f":"0","v":0},{"$f":"0","v":0},{"$f":"0","v":0},{"$f":"0","v":0},{"$f":"0","v":0},{"$f":"0","v":0}]
[null,"2.1.2","na spłatę przejętych zobowiązań samodzielnego publicznego zakładu opieki zdrowotnej przekształconego na zasadach określonych w przepisach o działalności leczniczej, w wysokości w jakiej nie podlegają sfinansowaniu dotacją z budżetu państwa)","na spłatę przejętych zobowiązań samodzielnego publicznego zakładu opieki zdrowotnej przekształconego na zasadach określonych w przepisach o działalności leczniczej, w wysokości w jakiej nie podlegają sfinansowaniu dotacją z budżetu państwa)","x","x","x","x",{"$f":"0","v":0},{"$f":"0","v":0},{"$f":"0","v":0},{"$f":"0","v":0},{"$f":"0","v":0},{"$f":"0","v":0},{"$f":"0","v":0},{"$f":"0","v":0},{"$f":"0","v":0},{"$f":"0","v":0},{"$f":"0","v":0}]
["x","2.1.3","Wydatki na obsługę długu","wydatki na obsługę długu, w tym:",{"$f":"464051.55","v":464051.55},{"$f":"755389.64","v":755389.64},{"$f":"884400","v":884400},{"$f":"791159.57","v":791159.57},{"$f":"700000","v":700000},{"$f":"602000","v":602000},{"$f":"559000","v":559000},{"$f":"503000","v":503000},{"$f":"434000","v":434000},{"$f":"366000","v":366000},{"$f":"302000","v":302000},{"$f":"237000","v":237000},{"$f":"185000","v":185000},{"$f":"128000","v":128000},{"$f":"69000","v":69000}]
["x","2.1.3.1","odsetki i dyskonto określone w art. 243 ust. 1 ustawy lub art. 169 ust. 1 ufp z 2005 r..","odsetki i dyskonto określone w art. 243 ust. 1 ustawy lub art. 169 ust. 1 ufp z 2005 r..",{"$f":"464051.55","v":464051.55},{"$f":"755389.64","v":755389.64},{"$f":"884400","v":884400},{"$f":"791159.57","v":791159.57},{"$f":"700000","v":700000},{"$f":"602000","v":602000},{"$f":"559000","v":559000},{"$f":"503000","v":503000},{"$f":"434000","v":434000},{"$f":"366000","v":366000},{"$f":"302000","v":302000},{"$f":"237000","v":237000},{"$f":"185000","v":185000},{"$f":"128000","v":128000},{"$f":"69000","v":69000}]
["x","2.2","Wydatki majątkowe","Wydatki majątkowe",{"$f":"9401653.73","v":9401653.7300000004},{"$f":"4907950.29","v":4907950.29},{"$f":"11277160.42","v":11277160.42},{"$f":"9599595.89","v":9599595.8900000006},{"$f":"8408716.14","v":8408716.1400000006},{"$f":"3683005.4","v":3683005.4},{"$f":"3134308","v":3134308},{"$f":"2514304","v":2514304},{"$f":"2294300","v":2294300},{"$f":"2591796","v":2591796},{"$f":"2719996","v":2719996},{"$f":"2749996","v":2749996},{"$f":"2779996","v":2779996},{"$f":"2789996","v":2789996},{"$f":"2730000","v":2730000}]
["x",3,"Wynik budżetu","Wynik budżetu",{"$f":"-3124459.69","v":-3124459.69},{"$f":"26238.4","v":26238.400000000001},{"$f":"-4871540.93","v":-4871540.93},{"$f":"-1946205.92","v":-1946205.92},{"$f":"-2607411.22","v":-2607411.2200000002},{"$f":"938060.16","v":938060.16},{"$f":"1215692","v":1215692},{"$f":"1565696","v":1565696},{"$f":"1915700","v":1915700},{"$f":"1678204","v":1678204},{"$f":"1610004","v":1610004},{"$f":"1610004","v":1610004},{"$f":"1610004","v":1610004},{"$f":"1650004","v":1650004},{"$f":"1710000","v":1710000}]
["x",4,"Przychody budżetu","Przychody budżetu",{"$f":"6000000","v":6000000},{"$f":"3600000","v":3600000},{"$f":"6775540.93","v":6775540.9299999997},{"$f":"6456793.84","v":6456793.8399999999},{"$f":"7317411.22","v":7317411.2199999997},{"$f":"0","v":0},{"$f":"0","v":0},{"$f":"0","v":0},{"$f":"0","v":0},{"$f":"0","v":0},{"$f":"0","v":0},{"$f":"0","v":0},{"$f":"0","v":0},{"$f":"0","v":0},{"$f":"0","v":0}]
["x","4.1","Nadwyżka budżetowa z lat ubiegłych, w tym:","Nadwyżka budżetowa z lat ubiegłych, w tym:",{"$f":"0","v":0},{"$f":"0","v":0},{"$f":"0","v":0},{"$f":"0","v":0},{"$f":"0","v":0},{"$f":"0","v":0},{"$f":"0","v":0},{"$f":"0","v":0},{"$f":"0","v":0},{"$f":"0","v":0},{"$f":"0","v":0},{"$f":"0","v":0},{"$f":"0","v":0},{"$f":"0","v":0},{"$f":"0","v":0}]
["x","4.1.1","na pokrycie deficytu budżetu","na pokrycie deficytu budżetu",{"$f":"0","v":0},{"$f":"0","v":0},{"$f":"0","v":0},{"$f":"0","v":0},{"$f":"0","v":0},{"$f":"0","v":0},{"$f":"0","v":0},{"$f":"0","v":0},{"$f":"0","v":0},{"$f":"0","v":0},{"$f":"0","v":0},{"$f":"0","v":0},{"$f":"0","v":0},{"$f":"0","v":0},{"$f":"0","v":0}]
["x","4.2","Wolne środki, o których mowa w art. 217 ust.2 pkt 6 ustawy, w tym:","Wolne środki, o których mowa w art. 217 ust.2 pkt 6 ustawy, w tym:",{"$f":"0","v":0},{"$f":"0","v":0},{"$f":"2956793.84","v":2956793.84},{"$f":"2956793.84","v":2956793.84},{"$f":"2607411.22","v":2607411.2200000002},{"$f":"0","v":0},{"$f":"0","v":0},{"$f":"0","v":0},{"$f":"0","v":0},{"$f":"0","v":0},{"$f":"0","v":0},{"$f":"0","v":0},{"$f":"0","v":0},{"$f":"0","v":0},{"$f":"0","v":0}]
["x","4.2.1","na pokrycie deficytu budżetu","na pokrycie deficytu budżetu",{"$f":"0","v":0},{"$f":"0","v":0},{"$f":"1052793.84","v":1052793.8400000001},{"$f":"1052793.84","v":1052793.8400000001},{"$f":"2607411.22","v":2607411.2200000002},{"$f":"0","v":0},{"$f":"0","v":0},{"$f":"0","v":0},{"$f":"0","v":0},{"$f":"0","v":0},{"$f":"0","v":0},{"$f":"0","v":0},{"$f":"0","v":0},{"$f":"0","v":0},{"$f":"0","v":0}]
["x","4.3","Kredyty, pożyczki, emisja papierów wartościowych, w tym:","Kredyty, pożyczki, emisja papierów wartościowych, w tym:",{"$f":"6000000","v":6000000},{"$f":"3600000","v":3600000},{"$f":"3818747.09","v":3818747.09},{"$f":"3500000","v":3500000},{"$f":"4710000","v":4710000},{"$f":"0","v":0},{"$f":"0","v":0},{"$f":"0","v":0},{"$f":"0","v":0},{"$f":"0","v":0},{"$f":"0","v":0},{"$f":"0","v":0},{"$f":"0","v":0},{"$f":"0","v":0},{"$f":"0","v":0}]
["x","4.3.1","na pokrycie deficytu budżetu","na pokrycie deficytu budżetu",{"$f":"0","v":0},{"$f":"0","v":0},{"$f":"0","v":0},{"$f":"0","v":0},{"$f":"0","v":0},{"$f":"0","v":0},{"$f":"0","v":0},{"$f":"0","v":0},{"$f":"0","v":0},{"$f":"0","v":0},{"$f":"0","v":0},{"$f":"0","v":0},{"$f":"0","v":0},{"$f":"0","v":0},{"$f":"0","v":0}]
["x","4.4","Inne przychody niezwiązane z zaciągnięciem długu, w tym:","Inne przychody niezwiązane z zaciągnięciem długu, w tym:",{"$f":"0","v":0},{"$f":"0","v":0},{"$f":"0","v":0},{"$f":"0","v":0},{"$f":"0","v":0},{"$f":"0","v":0},{"$f":"0","v":0},{"$f":"0","v":0},{"$f":"0","v":0},{"$f":"0","v":0},{"$f":"0","v":0},{"$f":"0","v":0},{"$f":"0","v":0},{"$f":"0","v":0},{"$f":"0","v":0}]
["x","4.4.1","na pokrycie deficytu budżetu","na pokrycie deficytu budżetu",{"$f":"0","v":0},{"$f":"0","v":0},{"$f":"0","v":0},{"$f":"0","v":0},{"$f":"0","v":0},{"$f":"0","v":0},{"$f":"0","v":0},{"$f":"0","v":0},{"$f":"0","v":0},{"$f":"0","v":0},{"$f":"0","v":0},{"$f":"0","v":0},{"$f":"0","v":0},{"$f":"0","v":0},{"$f":"0","v":0}]
["x",5,"Rozchody budżetu","Rozchody budżetu",{"$f":"1916539.28","v":1916539.28},{"$f":"2541577.28","v":2541577.2799999998},{"$f":"1904000","v":1904000},{"$f":"1903176.7","v":1903176.7},{"$f":"4710000","v":4710000},{"$f":"938060.16","v":938060.16},{"$f":"1215692","v":1215692},{"$f":"1565696","v":1565696},{"$f":"1915700","v":1915700},{"$f":"1678204","v":1678204},{"$f":"1610004","v":1610004},1610004,1610004,{"$f":"1650004","v":1650004},{"$f":"1710000","v":1710000}]
["x","5.1","Spłaty rat kapitałowych kredytów i pożyczek oraz wykup papierów wartościowych","Spłaty rat kapitałowych kredytów i pożyczek oraz wykup papierów wartościowych, w tym:",{"$f":"1916539.28","v":1916539.28},{"$f":"2541577.28","v":2541577.2799999998},{"$f":"1904000","v":1904000},{"$f":"1903176.7","v":1903176.7},{"$f":"4710000","v":4710000},{"$f":"938060.16","v":938060.16},{"$f":"1215692","v":1215692},{"$f":"1565696","v":1565696},{"$f":"1915700","v":1915700},{"$f":"1678204","v":1678204},1610004,1610004,1610004,{"$f":"1650004","v":1650004},{"$f":"1710000","v":1710000}]
["x","5.1.1","łączna kwota przypadających na dany rok kwot wyłączeń określonych w: art. 243 ust. 3 pkt 1 ustawy (lub art. 169 ust. 3 pkt 1 ufp z 2005 r.), art. 121a ustawy z dnia 27 sierpnia 2009 r. – Przepisy wprowadzające ustawę o finansach publicznych (Dz. U. Nr 157, poz. 1241, z późn. zm.) oraz art. 36 ustawy z dnia 7 grudnia 2012 r. o zmianie niektórych ustaw związanych z realizacją ustawy budżetowej (Dz.U. poz. 1456), w tym:","łączna kwota przypadających na dany rok kwot wyłączeń określonych w: art. 243 ust. 3 pkt 1 ustawy (lub art. 169 ust. 3 pkt 1 ufp z 2005 r.), art. 121a ustawy z dnia 27 sierpnia 2009 r. – Przepisy wprowadzające ustawę o finansach publicznych (Dz. U. Nr 157, poz. 1241, z późn. zm.) oraz art. 36 ustawy z dnia 7 grudnia 2012 r. o zmianie niektórych ustaw związanych z realizacją ustawy budżetowej (Dz.U. poz. 1456), w tym:",{"$f":"0","v":0},{"$f":"0","v":0},{"$f":"0","v":0},{"$f":"0","v":0},{"$f":"0","v":0},{"$f":"0","v":0},{"$f":"0","v":0},{"$f":"0","v":0},{"$f":"0","v":0},{"$f":"0","v":0},{"$f":"0","v":0},{"$f":"0","v":0},{"$f":"0","v":0},{"$f":"0","v":0},{"$f":"0","v":0}]
["x","5.1.1.1","kwota przypadających na dany rok kwot wyłączeń określonych w art. 243 ust. 3 pkt 1 ustawy lub art. 169 ust. 3 pkt 1 ufp z 2005 r.","kwota przypadających na dany rok kwot wyłączeń określonych w art. 243 ust. 3 pkt 1 ustawy lub art. 169 ust. 3 pkt 1 ufp z 2005 r.",{"$f":"0","v":0},{"$f":"0","v":0},{"$f":"0","v":0},{"$f":"0","v":0},{"$f":"0","v":0},{"$f":"0","v":0},{"$f":"0","v":0},{"$f":"0","v":0},{"$f":"0","v":0},{"$f":"0","v":0},{"$f":"0","v":0},{"$f":"0","v":0},{"$f":"0","v":0},{"$f":"0","v":0},{"$f":"0","v":0}]
[null,"5.2","Inne rozchody niezwiązane ze spłatą długu","Inne rozchody niezwiązane ze spłatą długu",{"$f":"0","v":0},{"$f":"0","v":0},{"$f":"0","v":0},{"$f":"0","v":0},{"$f":"0","v":0},{"$f":"0","v":0},{"$f":"0","v":0},{"$f":"0","v":0},{"$f":"0","v":0},{"$f":"0","v":0},{"$f":"0","v":0},{"$f":"0","v":0},{"$f":"0","v":0},{"$f":"0","v":0},{"$f":"0","v":0}]
["x",6,"Kwota długu","Kwota długu",{"$f":"12848122.14","v":12848122.140000001},{"$f":"13906544.86","v":13906544.859999999},{"$f":"15821291.95","v":15821291.949999999},{"$f":"15503368.16","v":15503368.16},{"$f":"15503368.16","v":15503368.16},{"$f":"14565308","v":14565308},{"$f":"13349616","v":13349616},{"$f":"11783920","v":11783920},{"$f":"9868220","v":9868220},{"$f":"8190016","v":8190016},{"$f":"6580012","v":6580012},{"$f":"4970008","v":4970008},{"$f":"3360004","v":3360004},{"$f":"1710000","v":1710000},{"$f":"0","v":0}]
[null,"6.1","Łączna kwota wyłączeń z ograniczeń długu określonych w art. 170 ust. 3 ufp z 2005 r. oraz w art. 36 ustawy o zmianie niektórych ustaw związanych z realizacją ustawy budżetowej, w tym: ","Łączna kwota wyłączeń z ograniczeń długu określonych w art. 170 ust. 3 ufp z 2005 r. oraz w art. 36 ustawy o zmianie niektórych ustaw związanych z realizacją ustawy budżetowej, w tym: ",{"$f":"0","v":0},{"$f":"0","v":0},{"$f":"0","v":0},{"$f":"0","v":0},{"$f":"0","v":0},{"$f":"0","v":0},{"$f":"0","v":0},{"$f":"0","v":0},{"$f":"0","v":0},{"$f":"0","v":0},{"$f":"0","v":0},{"$f":"0","v":0},{"$f":"0","v":0},{"$f":"0","v":0},{"$f":"0","v":0}]
[null,"6.1.1","kwota wyłączeń z ograniczeń długu określonych w art. 170 ust. 3 ufp z 2005 r. ","kwota wyłączeń z ograniczeń długu określonych w art. 170 ust. 3 ufp z 2005 r. ",{"$f":"0","v":0},{"$f":"0","v":0},{"$f":"0","v":0},{"$f":"0","v":0},{"$f":"0","v":0},{"$f":"0","v":0},{"$f":"0","v":0},{"$f":"0","v":0},{"$f":"0","v":0},{"$f":"0","v":0},{"$f":"0","v":0},{"$f":"0","v":0},{"$f":"0","v":0},{"$f":"0","v":0},{"$f":"0","v":0}]
[null,"6.2","Wskaźnik z art. 170 ufp z 2005 r., bez uwzględniania wyłączeń","Wskaźnik zadłużenia do dochodów ogółem określony w art. 170 ufp z 2005 r., bez uwzględniania wyłączeń określonych w pkt 6.1.",{"$f":"0.4081","v":0.40810000000000002},{"$f":"0.4477","v":0.44769999999999999},{"$f":"0.4441","v":0.44409999999999999},{"$f":"0.4502","v":0.45019999999999999},{"$f":"0.4174","v":0.41739999999999999},{"$f":"0.4624","v":0.46239999999999998},{"$f":"0.4238","v":0.42380000000000001},{"$f":"0.3741","v":0.37409999999999999},{"$f":"0.3084","v":0.30840000000000001},{"$f":"0.252","v":0.252},{"$f":"0.1994","v":0.19939999999999999},{"$f":"0.1484","v":0.1484},{"$f":"0.0988","v":9.8799999999999999E-2},{"$f":"0.0496","v":4.9599999999999998E-2},{"$f":"0","v":0}]
[null,"6.3","Wskaźnik z art. 170 ufp z 2005 r. po uwzględnieniu wyłączeń","Wskaźnik zadłużenia do dochodów ogółem, o którym mowa w art. 170 ufp z 2005 r., po uwzględnieniu wyłączeń określonych w pkt 6.1. ",{"$f":"0.4081","v":0.40810000000000002},{"$f":"0.4477","v":0.44769999999999999},{"$f":"0.4441","v":0.44409999999999999},{"$f":"0.4502","v":0.45019999999999999},{"$f":"0.4174","v":0.41739999999999999},{"$f":"0.4624","v":0.46239999999999998},{"$f":"0.4238","v":0.42380000000000001},{"$f":"0.3741","v":0.37409999999999999},{"$f":"0.3084","v":0.30840000000000001},{"$f":"0.252","v":0.252},{"$f":"0.1994","v":0.19939999999999999},{"$f":"0.1484","v":0.1484},{"$f":"0.0988","v":9.8799999999999999E-2},{"$f":"0.0496","v":4.9599999999999998E-2},{"$f":"0","v":0}]
[null,7,"Kwota zobowiązań wynikających z przejęcia przez jednostkę samorządu terytorialnego zobowiązań po likwidowanych i przekształcanych jednostkach zaliczanych do sektora finansów publicznych","Kwota zobowiązań wynikających z przejęcia przez jednostkę samorządu terytorialnego zobowiązań po likwidowanych i przekształcanych jednostkach zaliczanych do sektora finansów publicznych",{"$f":"0","v":0},{"$f":"0","v":0},{"$f":"0","v":0},{"$f":"0","v":0},{"$f":"0","v":0},{"$f":"0","v":0},{"$f":"0","v":0},{"$f":"0","v":0},{"$f":"0","v":0},{"$f":"0","v":0},{"$f":"0","v":0},{"$f":"0","v":0},{"$f":"0","v":0},{"$f":"0","v":0},{"$f":"0","v":0}]
[null,8,"Relacja zrównoważenia wydatków bieżących, o której mowa w art. 242 ustawy","Relacja zrównoważenia wydatków bieżących, o której mowa w art. 242 ustawy","x","x","x","x","x","x","x","x","x","x","x","x","x","x","x"]
[null,"8.1","Różnica między dochodami bieżącymi a wydatkami bieżącymi","Różnica między dochodami bieżącymi a wydatkami bieżącymi",{"$f":"686104.21","v":686104.21},{"$f":"2283237.55","v":2283237.5499999998},{"$f":"697224.01","v":697224.01},{"$f":"2632856.16","v":2632856.16},{"$f":"1126961.56","v":1126961.56},{"$f":"4621065.56","v":4621065.5599999996},{"$f":"4350000","v":4350000},{"$f":"4080000","v":4080000},{"$f":"4210000","v":4210000},{"$f":"4270000","v":4270000},{"$f":"4330000","v":4330000},{"$f":"4360000","v":4360000},{"$f":"4390000","v":4390000},{"$f":"4440000","v":4440000},{"$f":"4440000","v":4440000}]
[null,"8.2","Różnica między dochodami bieżącymi, powiększonymi o nadwyżkę budżetową określoną w pkt 4.1. i wolne środki określone w pkt 4.2. a wydatkami bieżącymi, pomniejszonym o wydatki określone w pkt 2.1.2.","Różnica między dochodami bieżącymi, powiększonymi o nadwyżkę budżetową określoną w pkt 4.1. i wolne środki określone w pkt 4.2. a wydatkami bieżącymi, pomniejszonym o wydatki określone w pkt 2.1.2.",{"$f":"686104.21","v":686104.21},{"$f":"2283237.55","v":2283237.5499999998},{"$f":"3654017.85","v":3654017.85},{"$f":"5589650","v":5589650},{"$f":"3734372.78","v":3734372.78},{"$f":"4621065.56","v":4621065.5599999996},{"$f":"4350000","v":4350000},{"$f":"4080000","v":4080000},{"$f":"4210000","v":4210000},{"$f":"4270000","v":4270000},{"$f":"4330000","v":4330000},{"$f":"4360000","v":4360000},{"$f":"4390000","v":4390000},{"$f":"4440000","v":4440000},{"$f":"4440000","v":4440000}]
["x",9,"Wskaźnik spłaty zobowiązań","Wskaźnik spłaty zobowiązań","x","x","x","x","x","x","x","x","x","x","x","x","x","x","x"]
[null,"9.1","Wskaźnik z art. 169 ust. 1 ufp z 2005 r. bez uwzględnienia wyłączeń","Wskaźnik planowanej łącznej kwoty spłaty zobowiązań, o której mowa w art. 169 ust. 1 ufp z 2005 r. do dochodów ogółem, bez uwzględnienia wyłączeń określonych w pkt 5.1.1. ",{"$f":"0.0756","v":7.5600000000000001E-2},{"$f":"0.1061","v":0.1061},{"$f":"0.0797","v":7.9699999999999993E-2},{"$f":"0.0782","v":7.8200000000000006E-2},{"$f":"0.1456","v":0.14560000000000001},{"$f":"0.0524","v":5.2400000000000002E-2},{"$f":"0.0598","v":5.9799999999999999E-2},{"$f":"0.0692","v":6.9199999999999998E-2},{"$f":"0.0769","v":7.6899999999999996E-2},{"$f":"0.0663","v":6.6299999999999998E-2},{"$f":"0.0613","v":6.13E-2},{"$f":"0.0584","v":5.8400000000000001E-2},{"$f":"0.0558","v":5.5800000000000002E-2},{"$f":"0.0532","v":5.3199999999999997E-2},{"$f":"0.0525","v":5.2499999999999998E-2}]
[null,"9.2","Wskaźnik z art. 169 ust. 1 ufp z 2005 r. po uwzględnieniu wyłączeń","Wskaźnik planowanej łącznej kwoty spłaty zobowiązań, o której mowa w art. 169 ust. 1 ufp z 2005 r. do dochodów ogółem, po uwzględnieniu wyłączeń przypadających na dany rok określonych w pkt 5.1.1. ",{"$f":"0.0756","v":7.5600000000000001E-2},{"$f":"0.1061","v":0.1061},{"$f":"0.0797","v":7.9699999999999993E-2},{"$f":"0.0782","v":7.8200000000000006E-2},{"$f":"0.1456","v":0.14560000000000001},{"$f":"0.0524","v":5.2400000000000002E-2},{"$f":"0.0598","v":5.9799999999999999E-2},{"$f":"0.0692","v":6.9199999999999998E-2},{"$f":"0.0769","v":7.6899999999999996E-2},{"$f":"0.0663","v":6.6299999999999998E-2},{"$f":"0.0613","v":6.13E-2},{"$f":"0.0584","v":5.8400000000000001E-2},{"$f":"0.0558","v":5.5800000000000002E-2},{"$f":"0.0532","v":5.3199999999999997E-2},{"$f":"0.0525","v":5.2499999999999998E-2}]
["x","9.3","Relacja [R+O]/D , bez uwzględnienia zobowiązań związku JST i bez uwzględniania wyłączeń","Wskaźnik planowanej łącznej kwoty spłaty zobowiązań, o której mowa w art. 243 ust. 1 ustawy do dochodów ogółem, bez uwzględnienia zobowiązań związku współtworzonego przez jednostkę samorządu terytorialnego i bez uwzględniania wyłączeń przypadających na dany rok określonych w pkt 5.1.1.",{"$f":"0.0756","v":7.5600000000000001E-2},{"$f":"0.1061","v":0.1061},{"$f":"0.0797","v":7.9699999999999993E-2},{"$f":"0.0782","v":7.8200000000000006E-2},{"$f":"0.1456","v":0.14560000000000001},{"$f":"0.0524","v":5.2400000000000002E-2},{"$f":"0.0598","v":5.9799999999999999E-2},{"$f":"0.0692","v":6.9199999999999998E-2},{"$f":"0.0769","v":7.6899999999999996E-2},{"$f":"0.0663","v":6.6299999999999998E-2},{"$f":"0.0613","v":6.13E-2},{"$f":"0.0584","v":5.8400000000000001E-2},{"$f":"0.0558","v":5.5800000000000002E-2},{"$f":"0.0532","v":5.3199999999999997E-2},{"$f":"0.0525","v":5.2499999999999998E-2}]
["x","9.4","Wskaźnik planowanej łącznej kwoty spłaty zobowiązań, o której mowa w art. 243 ust. 1 ustawy do dochodów ogółem, bez uwzględnienia zobowiązań związku współtworzonego przez jednostkę samorządu terytorialnego, po uwzględnieniu wyłączeń przypadających na dany rok określonych w pkt 5.1.1. ","Wskaźnik planowanej łącznej kwoty spłaty zobowiązań, o której mowa w art. 243 ust. 1 ustawy do dochodów ogółem, bez uwzględnienia zobowiązań związku współtworzonego przez jednostkę samorządu terytorialnego, po uwzględnieniu wyłączeń przypadających na dany rok określonych w pkt 5.1.1. ",{"$f":"0.0756","v":7.5600000000000001E-2},{"$f":"0.1061","v":0.1061},{"$f":"0.0797","v":7.9699999999999993E-2},{"$f":"0.0782","v":7.8200000000000006E-2},{"$f":"0.1456","v":0.14560000000000001},{"$f":"0.0524","v":5.2400000000000002E-2},{"$f":"0.0598","v":5.9799999999999999E-2},{"$f":"0.0692","v":6.9199999999999998E-2},{"$f":"0.0769","v":7.6899999999999996E-2},{"$f":"0.0663","v":6.6299999999999998E-2},{"$f":"0.0613","v":6.13E-2},{"$f":"0.0584","v":5.8400000000000001E-2},{"$f":"0.0558","v":5.5800000000000002E-2},{"$f":"0.0532","v":5.3199999999999997E-2},{"$f":"0.0525","v":5.2499999999999998E-2}]
["x","9.5","Kwota zobowiązań związku współtworzonego przez jednostkę samorządu terytorialnego przypadających do spłaty w danym roku budżetowym, podlegająca doliczeniu zgodnie z art. 244 ustawy ","Kwota zobowiązań związku współtworzonego przez jednostkę samorządu terytorialnego przypadających do spłaty w danym roku budżetowym, podlegająca doliczeniu zgodnie z art. 244 ustawy ",{"$f":"0","v":0},{"$f":"0","v":0},{"$f":"0","v":0},{"$f":"0","v":0},{"$f":"0","v":0},{"$f":"0","v":0},{"$f":"0","v":0},{"$f":"0","v":0},{"$f":"0","v":0},{"$f":"0","v":0},{"$f":"0","v":0},{"$f":"0","v":0},{"$f":"0","v":0},{"$f":"0","v":0},{"$f":"0","v":0}]
["x","9.6","Relacja [R+O]/D , z uwzględnieniem zobowiązań związku JST i po uwzględnianiu wyłączeń","Wskaźnik planowanej łącznej kwoty spłaty zobowiązań, o której mowa w art. 243 ust. 1 ustawy do dochodów ogółem, po uwzględnieniu zobowiązań związku współtworzonego przez jednostkę samorządu terytorialnego oraz po uwzględnieniu wyłączeń przypadających na dany rok określonych w pkt 5.1.1.",{"$f":"0.0756","v":7.5600000000000001E-2},{"$f":"0.1061","v":0.1061},{"$f":"0.0797","v":7.9699999999999993E-2},{"$f":"0.0782","v":7.8200000000000006E-2},{"$f":"0.1456","v":0.14560000000000001},{"$f":"0.0524","v":5.2400000000000002E-2},{"$f":"0.0598","v":5.9799999999999999E-2},{"$f":"0.0692","v":6.9199999999999998E-2},{"$f":"0.0769","v":7.6899999999999996E-2},{"$f":"0.0663","v":6.6299999999999998E-2},{"$f":"0.0613","v":6.13E-2},{"$f":"0.0584","v":5.8400000000000001E-2},{"$f":"0.0558","v":5.5800000000000002E-2},{"$f":"0.0532","v":5.3199999999999997E-2},{"$f":"0.0525","v":5.2499999999999998E-2}]
["x","9.6.1","Wskaźnik jednoroczny (prawa strona wzoru z art. 243)","Wskaźnik jednoroczny (prawa strona wzoru z art. 243)",{"$f":"+IF(E4<>0,(E5+E13-E16)/E4,0)","v":6.426086160724892E-2},{"$f":"+IF(F4<>0,(F5+F13-F16)/F4,0)","v":7.4339581733020466E-2},{"$f":"+IF(G4<>0,(G5+G13-G16)/G4,0)","v":2.2378770663430053E-2},{"$f":"+IF(H4<>0,(H5+H13-H16)/H4,0)","v":8.1093861393892561E-2},{"$f":"+IF(I4<>0,(I5+I13-I16)/I4,0)","v":3.370543229715673E-2},{"$f":"+IF(J4<>0,(J5+J13-J16)/J4,0)","v":0.14670049066167154},0.1380952380952381,0.12952380952380951,0.1315625,0.13138461538461538,0.13121212121212122,0.13014925373134328,0.12911764705882353,0.12869565217391304,0.12685714285714286]
["x","9.7","Limit spłaty zobowiązań z art. 243 ustawy, po uwzględnieniu wyłączeń obliczony w oparciu o plan 3 kw. roku N-1","Dopuszczalny wskaźnik spłaty zobowiązań określony w art. 243 ustawy, po uwzględnieniu wyłączeń określonych w art. 36 ustawy z dnia 7 grudnia 2012 r. o zmianie niektórych ustaw związanych z realizacją ustawy budżetowej, obliczony w oparciu o plan 3 kwartałów roku poprzedzającego rok budżetowy","x","x","x","x",{"$f":"0.0537","v":5.3699999999999998E-2},{"$f":"0.0435","v":4.3499999999999997E-2},{"$f":"0.0676","v":6.7599999999999993E-2},{"$f":"0.1062","v":0.1062},{"$f":"0.1381","v":0.1381},{"$f":"0.1331","v":0.1331},{"$f":"0.1308","v":0.1308},{"$f":"0.1314","v":0.13139999999999999},{"$f":"0.1309","v":0.13089999999999999},{"$f":"0.1301","v":0.13009999999999999},{"$f":"0.1293","v":0.1293}]
["x","9.7.1","Limit spłaty zobowiązań z art. 243 ustawy, po uwzględnieniu wyłączeń obliczony w oparciu o wykonanie 4 kw. roku N-1","Dopuszczalny wskaźnik spłaty zobowiązań określony w art. 243 ustawy, po uwzględnieniu wyłączeń określonych w art. 36 ustawy z dnia 7 grudnia 2012 r. o zmianie niektórych ustaw związanych z realizacją ustawy budżetowej, obliczony w oparciu o wykonanie roku poprzedzającego rok budżetowy","x","x","x","x",{"$f":"0.0732","v":7.3200000000000001E-2},{"$f":"0.063","v":6.3E-2},{"$f":"0.0872","v":8.72E-2},{"$f":"0.1062","v":0.1062},{"$f":"0.1381","v":0.1381},{"$f":"0.1331","v":0.1331},{"$f":"0.1308","v":0.1308},{"$f":"0.1314","v":0.13139999999999999},{"$f":"0.1309","v":0.13089999999999999},{"$f":"0.1301","v":0.13009999999999999},{"$f":"0.1293","v":0.1293}]
["x","9.8","Informacja o spełnieniu wskaźnika spłaty zobowiązań określonego w art. 243 ustawy, po uwzględnieniu zobowiązań związku współtworzonego przez jednostkę samorządu terytorialnego oraz po uwzględnieniu wyłączeń określonych w pkt 5.1.1., obliczonego w oparciu o plan 3 kwartałów roku poprzedzającego rok budżetowy","Informacja o spełnieniu wskaźnika spłaty zobowiązań określonego w art. 243 ustawy, po uwzględnieniu zobowiązań związku współtworzonego przez jednostkę samorządu terytorialnego oraz po uwzględnieniu wyłączeń określonych w pkt 5.1.1., obliczonego w oparciu o plan 3 kwartałów roku poprzedzającego rok budżetowy","x","x","x","x",{"$f":"IF(I53<=I55,\"Spełniona\",\"Nie spełniona\")","v":"Nie spełniona"},{"$f":"IF(J53<=J55,\"Spełniona\",\"Nie spełniona\")","v":"Nie spełniona"},"Spełniona","Spełniona","Spełniona","Spełniona","Spełniona","Spełniona","Spełniona","Spełniona","Spełniona"]
["x","9.8.1","Informacja o spełnieniu wskaźnika spłaty zobowiązań określonego w art. 243 ustawy, po uwzględnieniu zobowiązań związku współtworzonego przez jednostkę samorządu terytorialnego oraz po uwzględnieniu wyłączeń określonych w pkt 5.1.1., obliczonego w oparciu o wykonanie roku poprzedzającego rok budżetowy","Informacja o spełnieniu wskaźnika spłaty zobowiązań określonego w art. 243 ustawy, po uwzględnieniu zobowiązań związku współtworzonego przez jednostkę samorządu terytorialnego oraz po uwzględnieniu wyłączeń określonych w pkt 5.1.1., obliczonego w oparciu o wykonanie roku poprzedzającego rok budżetowy","x","x","x","x",{"$f":"IF(I53<=I56,\"Spełniona\",\"Nie spełniona\")","v":"Nie spełniona"},{"$f":"IF(J53<=J56,\"Spełniona\",\"Nie spełniona\")","v":"Spełniona"},"Spełniona","Spełniona","Spełniona","Spełniona","Spełniona","Spełniona","Spełniona","Spełniona","Spełniona"]
[null,10,"Przeznaczenie prognozowanej nadwyżki budżetowej, w tym na:","Przeznaczenie prognozowanej nadwyżki budżetowej, w tym na:",{"$f":"0","v":0},{"$f":"0","v":0},{"$f":"0","v":0},{"$f":"0","v":0},{"$f":"0","v":0},{"$f":"938060.16","v":938060.16},{"$f":"1215692","v":1215692},{"$f":"1565696","v":1565696},{"$f":"1915700","v":1915700},{"$f":"1678204","v":1678204},{"$f":"1610004","v":1610004},1610004,1610004,{"$f":"1650004","v":1650004},{"$f":"1710000","v":1710000}]
[null,"10.1","Spłaty kredytów, pożyczek i wykup papierów wartościowych","Spłaty kredytów, pożyczek i wykup papierów wartościowych",{"$f":"0","v":0},{"$f":"0","v":0},{"$f":"0","v":0},{"$f":"0","v":0},{"$f":"0","v":0},{"$f":"938060.16","v":938060.16},{"$f":"1215692","v":1215692},{"$f":"1565696","v":1565696},{"$f":"1915700","v":1915700},{"$f":"1678204","v":1678204},1610004,1610004,1610004,{"$f":"1650004","v":1650004},{"$f":"1710000","v":1710000}]
[null,11,"Informacje uzupełniające o wybranych rodzajach wydatków budżetowych","Informacje uzupełniające o wybranych rodzajach wydatków budżetowych","x","x","x","x","x","x","x","x","x","x","x","x","x","x","x"]
[null,"11.1","Wydatki na wynagrodzenia i składki od nich naliczane","Wydatki bieżące na wynagrodzenia i składki od nich naliczane",{"$f":"10915139.42","v":10915139.42},{"$f":"0","v":0},{"$f":"12203062","v":12203062},{"$f":"12006826.01","v":12006826.01},{"$f":"12581224","v":12581224},{"$f":"12400000","v":12400000},{"$f":"12800000","v":12800000},{"$f":"13000000","v":13000000},{"$f":"13200000","v":13200000},{"$f":"13400000","v":13400000},{"$f":"13600000","v":13600000},{"$f":"13800000","v":13800000},{"$f":"14000000","v":14000000},{"$f":"14251000","v":14251000},{"$f":"14500000","v":14500000}]
[null,"11.2","Wydatki związane z funkcjonowaniem organów JST","Wydatki związane z funkcjonowaniem organów jednostki samorządu terytorialnego",{"$f":"0","v":0},{"$f":"0","v":0},{"$f":"0","v":0},{"$f":"0","v":0},3148925.95,{"$f":"3000000","v":3000000},{"$f":"3100000","v":3100000},{"$f":"3200000","v":3200000},{"$f":"3300000","v":3300000},{"$f":"3400000","v":3400000},{"$f":"3500000","v":3500000},{"$f":"3600000","v":3600000},{"$f":"3700000","v":3700000},{"$f":"3800000","v":3800000},{"$f":"3900000","v":3900000}]
[null,"11.3","Wydatki objęte limitem art. 226 ust. 3 ustawy, z tego:","Wydatki objęte limitem art. 226 ust. 3 ustawy, z tego:",{"$f":"0","v":0},{"$f":"0","v":0},{"$f":"1841325","v":1841325},{"$f":"0","v":0},{"$f":"3754113.07","v":3754113.07},{"$f":"5777805.43","v":5777805.4299999997},{"$f":"449902.82","v":449902.82},{"$f":"56","v":56},{"$f":"56","v":56},{"$f":"56","v":56},{"$f":"56","v":56},{"$f":"20","v":20},{"$f":"0","v":0},{"$f":"0","v":0},{"$f":"0","v":0}]
[null,"11.3.1","Wydatki bieżące objęte limitem art. 226 ust. 3","bieżące",{"$f":"0","v":0},{"$f":"0","v":0},{"$f":"994525","v":994525},{"$f":"0","v":0},{"$f":"1322372.51","v":1322372.51},{"$f":"2157115.13","v":2157115.13},{"$f":"449902.82","v":449902.82},{"$f":"56","v":56},{"$f":"56","v":56},{"$f":"56","v":56},{"$f":"56","v":56},{"$f":"20","v":20},{"$f":"0","v":0},{"$f":"0","v":0},{"$f":"0","v":0}]
[null,"11.3.2","Wydatki majątkowe objęte limitem art. 226 ust. 3","majątkowe",{"$f":"0","v":0},{"$f":"0","v":0},{"$f":"846800","v":846800},{"$f":"0","v":0},{"$f":"2431740.56","v":2431740.56},{"$f":"3620690.3","v":3620690.3},{"$f":"0","v":0},{"$f":"0","v":0},{"$f":"0","v":0},{"$f":"0","v":0},{"$f":"0","v":0},{"$f":"0","v":0},{"$f":"0","v":0},{"$f":"0","v":0},{"$f":"0","v":0}]
[null,"11.4","Wydatki inwestycyjne kontynuowane ","Wydatki inwestycyjne kontynuowane ",{"$f":"0","v":0},{"$f":"0","v":0},{"$f":"0","v":0},{"$f":"0","v":0},{"$f":"5060975.58","v":5060975.58},{"$f":"0","v":0},{"$f":"0","v":0},{"$f":"0","v":0},{"$f":"0","v":0},{"$f":"0","v":0},{"$f":"0","v":0},{"$f":"0","v":0},{"$f":"0","v":0},{"$f":"0","v":0},{"$f":"0","v":0}]
[null,"11.5","Nowe wydatki inwestycyjne","Nowe wydatki inwestycyjne",{"$f":"0","v":0},{"$f":"0","v":0},{"$f":"0","v":0},{"$f":"0","v":0},{"$f":"2967740.56","v":2967740.56},{"$f":"0","v":0},{"$f":"0","v":0},{"$f":"0","v":0},{"$f":"0","v":0},{"$f":"0","v":0},{"$f":"0","v":0},{"$f":"0","v":0},{"$f":"0","v":0},{"$f":"0","v":0},{"$f":"0","v":0}]
[null,"11.6","Wydatki majątkowe w formie dotacji ","Wydatki majątkowe w formie dotacji ",{"$f":"0","v":0},{"$f":"0","v":0},{"$f":"0","v":0},{"$f":"0","v":0},{"$f":"380000","v":380000},{"$f":"0","v":0},{"$f":"0","v":0},{"$f":"0","v":0},{"$f":"0","v":0},{"$f":"0","v":0},{"$f":"0","v":0},{"$f":"0","v":0},{"$f":"0","v":0},{"$f":"0","v":0},{"$f":"0","v":0}]
[null,12,"Finansowanie programów, projektów lub zadań realizowanych z udziałem środków, o których mowa w art. 5 ust. 1 pkt 2 i 3 ustawy","Finansowanie programów, projektów lub zadań realizowanych z udziałem środków, o których mowa w art. 5 ust. 1 pkt 2 i 3 ustawy","x","x","x","x","x","x","x","x","x","x","x","x","x","x","x"]
[null,"12.1","Dochody bieżące na programy, projekty lub zadania finansowane z udziałem środków, o których mowa w art. 5 ust. 1 pkt 2 i 3 ustawy, w tym:","Dochody bieżące na programy, projekty lub zadania finansowane z udziałem środków, o których mowa w art. 5 ust. 1 pkt 2 i 3 ustawy, w tym:",{"$f":"0","v":0},{"$f":"0","v":0},{"$f":"0","v":0},{"$f":"931390.39","v":931390.39},{"$f":"1959769.75","v":1959769.75},{"$f":"222594.71","v":222594.71},{"$f":"0","v":0},{"$f":"0","v":0},{"$f":"0","v":0},{"$f":"0","v":0},{"$f":"0","v":0},{"$f":"0","v":0},{"$f":"0","v":0},{"$f":"0","v":0},{"$f":"0","v":0}]
[null,"12.1.1","środki określone w art. 5 ust. 1 pkt 2 ustawy, w tym:","środki określone w art. 5 ust. 1 pkt 2 ustawy, w tym:",{"$f":"965905.76","v":965905.76},{"$f":"0","v":0},{"$f":"0","v":0},{"$f":"931390.39","v":931390.39},{"$f":"1776085.14","v":1776085.14},{"$f":"222594.71","v":222594.71},{"$f":"0","v":0},{"$f":"0","v":0},{"$f":"0","v":0},{"$f":"0","v":0},{"$f":"0","v":0},{"$f":"0","v":0},{"$f":"0","v":0},{"$f":"0","v":0},{"$f":"0","v":0}]
[null,"12.1.1.1","środki określone w art. 5 ust. 1 pkt 2 ustawy wynikające wyłącznie z zawartych umów na realizację programu, projektu lub zadania","środki określone w art. 5 ust. 1 pkt 2 ustawy wynikające wyłącznie z zawartych umów na realizację programu, projektu lub zadania",{"$f":"0","v":0},{"$f":"0","v":0},{"$f":"0","v":0},{"$f":"0","v":0},{"$f":"1776085.14","v":1776085.14},{"$f":"222594.71","v":222594.71},{"$f":"0","v":0},{"$f":"0","v":0},{"$f":"0","v":0},{"$f":"0","v":0},{"$f":"0","v":0},{"$f":"0","v":0},{"$f":"0","v":0},{"$f":"0","v":0},{"$f":"0","v":0}]
[null,"12.2","Dochody majątkowe na programy, projekty lub zadania finansowane z udziałem środków, o których mowa w art. 5 ust. 1 pkt 2 i 3 ustawy, w tym:","Dochody majątkowe na programy, projekty lub zadania finansowane z udziałem środków, o których mowa w art. 5 ust. 1 pkt 2 i 3 ustawy, w tym:",{"$f":"0","v":0},{"$f":"0","v":0},{"$f":"0","v":0},{"$f":"0","v":0},{"$f":"3109680.36","v":3109680.36},{"$f":"0","v":0},{"$f":"0","v":0},{"$f":"0","v":0},{"$f":"0","v":0},{"$f":"0","v":0},{"$f":"0","v":0},{"$f":"0","v":0},{"$f":"0","v":0},{"$f":"0","v":0},{"$f":"0","v":0}]
[null,"12.2.1","środki określone w art. 5 ust. 1 pkt 2 ustawy, w tym:","środki określone w art. 5 ust. 1 pkt 2 ustawy, w tym:",{"$f":"3773685.71","v":3773685.71},{"$f":"0","v":0},{"$f":"3830155.48","v":3830155.48},{"$f":"3113726.16","v":3113726.16},{"$f":"3052450.3","v":3052450.3},{"$f":"0","v":0},{"$f":"0","v":0},{"$f":"0","v":0},{"$f":"0","v":0},{"$f":"0","v":0},{"$f":"0","v":0},{"$f":"0","v":0},{"$f":"0","v":0},{"$f":"0","v":0},{"$f":"0","v":0}]
[null,"12.2.1.1","środki określone w art. 5 ust. 1 pkt 2 ustawy wynikające wyłącznie z zawartych umów na realizację programu, projektu lub zadania","środki określone w art. 5 ust. 1 pkt 2 ustawy wynikające wyłącznie z zawartych umów na realizację programu, projektu lub zadania",{"$f":"0","v":0},{"$f":"0","v":0},{"$f":"0","v":0},{"$f":"0","v":0},{"$f":"3052450.3","v":3052450.3},{"$f":"0","v":0},{"$f":"0","v":0},{"$f":"0","v":0},{"$f":"0","v":0},{"$f":"0","v":0},{"$f":"0","v":0},{"$f":"0","v":0},{"$f":"0","v":0},{"$f":"0","v":0},{"$f":"0","v":0}]
[null,"12.3","Wydatki bieżące na programy, projekty lub zadania finansowane z udziałem środków, o których mowa w art. 5 ust. 1 pkt 2 i 3 ustawy","Wydatki bieżące na programy, projekty lub zadania finansowane z udziałem środków, o których mowa w art. 5 ust. 1 pkt 2 i 3 ustawy",{"$f":"0","v":0},{"$f":"0","v":0},{"$f":"0","v":0},{"$f":"0","v":0},{"$f":"1974899.23","v":1974899.23},{"$f":"262135.15","v":262135.15},{"$f":"0","v":0},{"$f":"0","v":0},{"$f":"0","v":0},{"$f":"0","v":0},{"$f":"0","v":0},{"$f":"0","v":0},{"$f":"0","v":0},{"$f":"0","v":0},{"$f":"0","v":0}]
[null,"12.3.1","w tym finansowane środkami określonymi w art. 5 ust. 1 pkt 2 ustawy ","w tym finansowane środkami określonymi w art. 5 ust. 1 pkt 2 ustawy ",{"$f":"0","v":0},{"$f":"0","v":0},{"$f":"1221877.52","v":1221877.52},{"$f":"1128926.89","v":1128926.8899999999},{"$f":"1681470","v":1681470},{"$f":"222594.71","v":222594.71},{"$f":"0","v":0},{"$f":"0","v":0},{"$f":"0","v":0},{"$f":"0","v":0},{"$f":"0","v":0},{"$f":"0","v":0},{"$f":"0","v":0},{"$f":"0","v":0},{"$f":"0","v":0}]
[null,"12.3.2","Wydatki bieżące na realizację programu, projektu lub zadania wynikające wyłącznie z zawartych umów z podmiotem dysponującym środkami, o których mowa w art. 5 ust. 1 pkt 2 ustawy ","Wydatki bieżące na realizację programu, projektu lub zadania wynikające wyłącznie z zawartych umów z podmiotem dysponującym środkami, o których mowa w art. 5 ust. 1 pkt 2 ustawy ",{"$f":"0","v":0},{"$f":"0","v":0},{"$f":"0","v":0},{"$f":"0","v":0},{"$f":"1974899.23","v":1974899.23},{"$f":"0","v":0},{"$f":"0","v":0},{"$f":"0","v":0},{"$f":"0","v":0},{"$f":"0","v":0},{"$f":"0","v":0},{"$f":"0","v":0},{"$f":"0","v":0},{"$f":"0","v":0},{"$f":"0","v":0}]
[null,"12.4","Wydatki majątkowe na programy, projekty lub zadania finansowane z udziałem środków, o których mowa w art. 5 ust. 1 pkt 2 i 3 ustawy","Wydatki majątkowe na programy, projekty lub zadania finansowane z udziałem środków, o których mowa w art. 5 ust. 1 pkt 2 i 3 ustawy",{"$f":"0","v":0},{"$f":"0","v":0},{"$f":"0","v":0},{"$f":"0","v":0},{"$f":"735014.91","v":735014.91},{"$f":"0","v":0},{"$f":"0","v":0},{"$f":"0","v":0},{"$f":"0","v":0},{"$f":"0","v":0},{"$f":"0","v":0},{"$f":"0","v":0},{"$f":"0","v":0},{"$f":"0","v":0},{"$f":"0","v":0}]
[null,"12.4.1","w tym finansowane środkami określonymi w art. 5 ust. 1 pkt 2 ustawy","w tym finansowane środkami określonymi w art. 5 ust. 1 pkt 2 ustawy",{"$f":"0","v":0},{"$f":"0","v":0},{"$f":"3830155.48","v":3830155.48},{"$f":"3360023.79","v":3360023.79},{"$f":"529995.71","v":529995.71},{"$f":"0","v":0},{"$f":"0","v":0},{"$f":"0","v":0},{"$f":"0","v":0},{"$f":"0","v":0},{"$f":"0","v":0},{"$f":"0","v":0},{"$f":"0","v":0},{"$f":"0","v":0},{"$f":"0","v":0}]
[null,"12.4.2","Wydatki majątkowe na realizację programu, projektu lub zadania wynikające wyłącznie z zawartych umów z podmiotem dysponującym środkami, o których mowa w art. 5 ust. 1 pkt 2 ustawy ","Wydatki majątkowe na realizację programu, projektu lub zadania wynikające wyłącznie z zawartych umów z podmiotem dysponującym środkami, o których mowa w art. 5 ust. 1 pkt 2 ustawy ",{"$f":"0","v":0},{"$f":"0","v":0},{"$f":"0","v":0},{"$f":"0","v":0},{"$f":"735014.91","v":735014.91},{"$f":"0","v":0},{"$f":"0","v":0},{"$f":"0","v":0},{"$f":"0","v":0},{"$f":"0","v":0},{"$f":"0","v":0},{"$f":"0","v":0},{"$f":"0","v":0},{"$f":"0","v":0},{"$f":"0","v":0}]
[null,13,"Kwoty dotyczące przejęcia i spłaty zobowiązań po samodzielnych publicznych zakładach opieki zdrowotnej oraz pokrycia ujemnego wyniku ","Kwoty dotyczące przejęcia i spłaty zobowiązań po samodzielnych publicznych zakładach opieki zdrowotnej oraz pokrycia ujemnego wyniku ","x","x","x","x","x","x","x","x","x","x","x","x","x","x","x"]
[null,"13.1","Kwota zobowiązań wynikających z przejęcia przez jednostkę samorządu terytorialnego zobowiązań po likwidowanych i przekształcanych samodzielnych zakładach opieki zdrowotnej","Kwota zobowiązań wynikających z przejęcia przez jednostkę samorządu terytorialnego zobowiązań po likwidowanych i przekształcanych samodzielnych zakładach opieki zdrowotnej",{"$f":"0","v":0},{"$f":"0","v":0},{"$f":"0","v":0},{"$f":"0","v":0},{"$f":"0","v":0},{"$f":"0","v":0},{"$f":"0","v":0},{"$f":"0","v":0},{"$f":"0","v":0},{"$f":"0","v":0},{"$f":"0","v":0},{"$f":"0","v":0},{"$f":"0","v":0},{"$f":"0","v":0},{"$f":"0","v":0}]
[null,"13.2","Dochody budżetowe z tytułu dotacji celowej z budżetu państwa, o której mowa w art. 196 ustawy z dnia 15 kwietnia 2011 r. o działalności leczniczej (Dz.U. Nr 112, poz. 654, z późn. zm.)","Dochody budżetowe z tytułu dotacji celowej z budżetu państwa, o której mowa w art. 196 ustawy z dnia 15 kwietnia 2011 r. o działalności leczniczej (Dz.U. Nr 112, poz. 654, z późn. zm.)",{"$f":"0","v":0},{"$f":"0","v":0},{"$f":"0","v":0},{"$f":"0","v":0},{"$f":"0","v":0},{"$f":"0","v":0},{"$f":"0","v":0},{"$f":"0","v":0},{"$f":"0","v":0},{"$f":"0","v":0},{"$f":"0","v":0},{"$f":"0","v":0},{"$f":"0","v":0},{"$f":"0","v":0},{"$f":"0","v":0}]
[null,"13.3","Wysokość zobowiązań podlegających umorzeniu, o którym mowa w art. 190 ustawy o działalności leczniczej","Wysokość zobowiązań podlegających umorzeniu, o którym mowa w art. 190 ustawy o działalności leczniczej",{"$f":"0","v":0},{"$f":"0","v":0},{"$f":"0","v":0},{"$f":"0","v":0},{"$f":"0","v":0},{"$f":"0","v":0},{"$f":"0","v":0},{"$f":"0","v":0},{"$f":"0","v":0},{"$f":"0","v":0},{"$f":"0","v":0},{"$f":"0","v":0},{"$f":"0","v":0},{"$f":"0","v":0},{"$f":"0","v":0}]
[null,"13.4","Wydatki na spłatę przejętych zobowiązań samodzielnego publicznego zakładu opieki zdrowotnej przekształconego na zasadach określonych w przepisach o działalności leczniczej","Wydatki na spłatę przejętych zobowiązań samodzielnego publicznego zakładu opieki zdrowotnej przekształconego na zasadach określonych w przepisach o działalności leczniczej",{"$f":"0","v":0},{"$f":"0","v":0},{"$f":"0","v":0},{"$f":"0","v":0},{"$f":"0","v":0},{"$f":"0","v":0},{"$f":"0","v":0},{"$f":"0","v":0},{"$f":"0","v":0},{"$f":"0","v":0},{"$f":"0","v":0},{"$f":"0","v":0},{"$f":"0","v":0},{"$f":"0","v":0},{"$f":"0","v":0}]
[null,"13.5","Wydatki na spłatę przejętych zobowiązań samodzielnego publicznego zakładu opieki zdrowotnej likwidowanego na zasadach określonych w przepisach o działalności leczniczej","Wydatki na spłatę przejętych zobowiązań samodzielnego publicznego zakładu opieki zdrowotnej likwidowanego na zasadach określonych w przepisach o działalności leczniczej",{"$f":"0","v":0},{"$f":"0","v":0},{"$f":"0","v":0},{"$f":"0","v":0},{"$f":"0","v":0},{"$f":"0","v":0},{"$f":"0","v":0},{"$f":"0","v":0},{"$f":"0","v":0},{"$f":"0","v":0},{"$f":"0","v":0},{"$f":"0","v":0},{"$f":"0","v":0},{"$f":"0","v":0},{"$f":"0","v":0}]
[null,"13.6","Wydatki na spłatę zobowiązań samodzielnego publicznego zakładu opieki zdrowotnej przejętych do końca 2011 r. na podstawie przepisów o zakładach opieki zdrowotnej","Wydatki na spłatę zobowiązań samodzielnego publicznego zakładu opieki zdrowotnej przejętych do końca 2011 r. na podstawie przepisów o zakładach opieki zdrowotnej",{"$f":"0","v":0},{"$f":"0","v":0},{"$f":"0","v":0},{"$f":"0","v":0},{"$f":"0","v":0},{"$f":"0","v":0},{"$f":"0","v":0},{"$f":"0","v":0},{"$f":"0","v":0},{"$f":"0","v":0},{"$f":"0","v":0},{"$f":"0","v":0},{"$f":"0","v":0},{"$f":"0","v":0},{"$f":"0","v":0}]
[null,"13.7","Wydatki bieżące na pokrycie ujemnego wyniku finansowego samodzielnego publicznego zakładu opieki zdrowotnej","Wydatki bieżące na pokrycie ujemnego wyniku finansowego samodzielnego publicznego zakładu opieki zdrowotnej",{"$f":"0","v":0},{"$f":"0","v":0},{"$f":"0","v":0},{"$f":"0","v":0},{"$f":"0","v":0},{"$f":"0","v":0},{"$f":"0","v":0},{"$f":"0","v":0},{"$f":"0","v":0},{"$f":"0","v":0},{"$f":"0","v":0},{"$f":"0","v":0},{"$f":"0","v":0},{"$f":"0","v":0},{"$f":"0","v":0}]
["x",14,"Dane uzupełniające o długu i jego spłacie","Dane uzupełniające o długu i jego spłacie","x","x","x","x","x","x","x","x","x","x","x","x","x","x","x"]
["x","14.1","Spłaty rat kapitałowych oraz wykup papierów wartościowych, o których mowa w pkt. 5.1., wynikające wyłącznie z tytułu zobowiązań już zaciągniętych","Spłaty rat kapitałowych oraz wykup papierów wartościowych, o których mowa w pkt. 5.1., wynikające wyłącznie z tytułu zobowiązań już zaciągniętych",{"$f":"0","v":0},{"$f":"0","v":0},{"$f":"0","v":0},{"$f":"0","v":0},{"$f":"4710000","v":4710000},{"$f":"938060.16","v":938060.16},{"$f":"1215692","v":1215692},{"$f":"1565696","v":1565696},{"$f":"1915700","v":1915700},{"$f":"1478204","v":1478204},{"$f":"1310004","v":1310004},{"$f":"1310004","v":1310004},{"$f":"710004","v":710004},{"$f":"350004","v":350004},{"$f":"0","v":0}]
["x","14.2","Kwota długu, którego planowana spłata dokona się z wydatków budżetu","Kwota długu, którego planowana spłata dokona się z wydatków budżetu",{"$f":"0","v":0},{"$f":"0","v":0},{"$f":"0","v":0},{"$f":"0","v":0},{"$f":"0","v":0},{"$f":"0","v":0},{"$f":"0","v":0},{"$f":"0","v":0},{"$f":"0","v":0},{"$f":"0","v":0},{"$f":"0","v":0},{"$f":"0","v":0},{"$f":"0","v":0},{"$f":"0","v":0},{"$f":"0","v":0}]
["x","14.3","Wydatki zmniejszające dług, w tym:","Wydatki zmniejszające dług, w tym:",{"$f":"0","v":0},{"$f":"0","v":0},{"$f":"0","v":0},{"$f":"0","v":0},{"$f":"0","v":0},{"$f":"0","v":0},{"$f":"0","v":0},{"$f":"0","v":0},{"$f":"0","v":0},{"$f":"0","v":0},{"$f":"0","v":0},{"$f":"0","v":0},{"$f":"0","v":0},{"$f":"0","v":0},{"$f":"0","v":0}]
["x","14.3.1","spłata zobowiązań wymagalnych z lat poprzednich, innych niż w pkt 14.3.3","spłata zobowiązań wymagalnych z lat poprzednich, innych niż w pkt 14.3.3",{"$f":"0","v":0},{"$f":"0","v":0},{"$f":"0","v":0},{"$f":"0","v":0},{"$f":"0","v":0},{"$f":"0","v":0},{"$f":"0","v":0},{"$f":"0","v":0},{"$f":"0","v":0},{"$f":"0","v":0},{"$f":"0","v":0},{"$f":"0","v":0},{"$f":"0","v":0},{"$f":"0","v":0},{"$f":"0","v":0}]
["x","14.3.2","związane z umowami zaliczanymi do tytułów dłużnych wliczanych w państwowy dług publiczny","związane z umowami zaliczanymi do tytułów dłużnych wliczanych w państwowy dług publiczny",{"$f":"0","v":0},{"$f":"0","v":0},{"$f":"0","v":0},{"$f":"0","v":0},{"$f":"0","v":0},{"$f":"0","v":0},{"$f":"0","v":0},{"$f":"0","v":0},{"$f":"0","v":0},{"$f":"0","v":0},{"$f":"0","v":0},{"$f":"0","v":0},{"$f":"0","v":0},{"$f":"0","v":0},{"$f":"0","v":0}]
["x","14.3.3","wypłaty z tytułu wymagalnych poręczeń i gwarancji","wypłaty z tytułu wymagalnych poręczeń i gwarancji",{"$f":"0","v":0},{"$f":"0","v":0},{"$f":"0","v":0},{"$f":"0","v":0},{"$f":"0","v":0},{"$f":"0","v":0},{"$f":"0","v":0},{"$f":"0","v":0},{"$f":"0","v":0},{"$f":"0","v":0},{"$f":"0","v":0},{"$f":"0","v":0},{"$f":"0","v":0},{"$f":"0","v":0},{"$f":"0","v":0}]
["x","14.4","Wynik operacji niekasowych wpływających na kwotę długu (m.in. umorzenia, różnice kursowe)","Wynik operacji niekasowych wpływających na kwotę długu (m.in. umorzenia, różnice kursowe)",{"$f":"0","v":0},{"$f":"0","v":0},{"$f":"0","v":0},{"$f":"0","v":0},{"$f":"0","v":0},{"$f":"0","v":0},{"$f":"0","v":0},{"$f":"0","v":0},{"$f":"0","v":0},{"$f":"0","v":0},{"$f":"0","v":0},{"$f":"0","v":0},{"$f":"0","v":0},{"$f":"0","v":0},{"$f":"0","v":0}]
[null,null,null,null,null,null,null,null,null,null,null,null,null,null,null,null,null,"PRZEWODNICZĄCY RADY"]
[null,null,null,null,null,null,null,null,null,null,null,null,null,null,null,null,null,"Zbigniew Bączyński"]
[]
[]
[]
[null,"Weryfikacja danych wykazanych w tabeli Wieloletnia Prognoza Finansowa"]
[null,null,null,"Reguła formalna"]
[null,null,null,"Reguła rachunkowa"]
[null,null,null,"Reguła logiczna"]
[null,null,null,"Reguły kontrolne"]
[null,"[1.1] + [4.1] + [4.2] >= ([2.1] - [2.1.2])",null,"Spełnienie wskaźnika z art. 242","x","x","x","x",{"$f":"IF(ROUND(I5+I25+I27,2)>=ROUND(I16-I19,2),\"TAK\",\"NIE\")","v":"TAK"},{"$f":"IF(ROUND(J5+J25+J27,2)>=ROUND(J16-J19,2),\"TAK\",\"NIE\")","v":"TAK"},"TAK","TAK","TAK","TAK","TAK","TAK","TAK","TAK","TAK"]
[null,null,null,"Spełnienie wskaźnika z art. 169 suofp (bez wyłączeń)","x","x","x","x",{"$f":"IF(I48<=15%,\"TAK\",\"NIE\")","v":"TAK"},"x","x","x","x","x","x","x","x","x","x"]
[null,null,null,"Spełnienie wskaźnika z art. 169 suofp (z wyłączeniami)","x","x","x","x",{"$f":"IF(I49<=15%,\"TAK\",\"NIE\")","v":"TAK"},"x","x","x","x","x","x","x","x","x","x"]
[null,null,null,"Spełnienie wskaźnika z art. 170 suofp (bez wyłączeń)","x","x","x","x",{"$f":"IF(I41<=60%,\"TAK\",\"NIE\")","v":"TAK"},"x","x","x","x","x","x","x","x","x","x"]
[null,null,null,"Spełnienie wskaźnika z art. 170 suofp (z wyłączeniami)","x","x","x","x",{"$f":"IF(I42<=60%,\"TAK\",\"NIE\")","v":"TAK"},"x","x","x","x","x","x","x","x","x","x"]
[null,"[13.3] = 0 (dla lat 2014 i wyższych)",null,"Umorzenie zobowiązań, o którym mowa w art. 190 ustawy o działalności leczniczej nie wykracza poza ustawowy okres","x","x","x","x","x","x",{"$f":"IF(K86=0,\"TAK\",\"BŁĄD\")","v":"TAK"},"TAK","TAK","TAK","TAK","TAK","TAK","TAK","TAK"]
[null,"[1] + [4] - [2] - [5] = 0",null,"Kontrola poprawności zbilansowania budżetu","x","x","x","x",{"$f":"IF(ROUND(I4+I24-I15-I33,2)=0,\"OK\",ROUND(I4+I24-I15-I33,2))","v":"OK"},{"$f":"IF(ROUND(J4+J24-J15-J33,2)=0,\"OK\",ROUND(J4+J24-J15-J33,2))","v":"OK"},"OK","OK","OK","OK","OK","OK","OK","OK","OK"]
[null,"[6]\"n\" = [6]\"n-1\" + [4.3]\"n\" - [5.1]\"n\" +  ([14.2]\"n\"-[14.2]\"n-1\") + [14.4]",null,"Kontrola poprawności wyliczenia kwoty długu","x","x","x","x",{"$f":"+IF(ROUND(H38+I29-I34+(I93-H93)+I98-I38,2)=0,\"OK\",ROUND(H38+I29-I34+(I93-H93)+I98-I38,2))","v":"OK"},{"$f":"+IF(ROUND(I38+J29-J34+(J93-I93)+J98-J38,2)=0,\"OK\",ROUND(I38+J29-J34+(J93-I93)+J98-J38,2))","v":"OK"},"OK","OK","OK","OK","OK","OK","OK","OK","OK"]
[null,"[14.2] \"n\" =  ( [14.2]  \"n-1\" -  [14.3] \"n\" ) ",null,"Analiza zmiany kwoty długu spłacanego wydatkami budżetu \n- wartości różne od zera wymagają objaśnienia \n   - wartości większe od zera wskazują na powstanie w roku prognozy nowego długu tego typu\n   - wartości mniejsze od zera co do zasady nie powinny wystąpić","x","x","x","x",{"$f":"+IF(H93=0,\"N/D\",IF(ROUND(I93+I94-H93,2)=0,\"OK\",ROUND(I93+I94-H93,2)))","v":"N/D"},{"$f":"+IF(I93=0,\"N/D\",IF(ROUND(J93+J94-I93,2)=0,\"OK\",ROUND(J93+J94-I93,2)))","v":"N/D"},"N/D","N/D","N/D","N/D","N/D","N/D","N/D","N/D","N/D"]
[null,"[13.1] \"n\"  -  ( [13.3] + [13.4] + [13.5] + [13.6] ) \"n\"  =  [13.1] \"n-1\"",null,"Porównanie na koniec roku prognozy stanu zobowiązań przejętych przez jst po likwidowanych i przekształcanych SP ZOZ z wydatkami i umorzeniami poniesionymi na ten cel ze stanem zobowiązań z okresu N-1","x","x","x","x",{"$f":"+IF(H84=0,\"N/D\",IF(ROUND(I84+(I86+I87+I88+I89)-H84,2)=0,\"OK\",ROUND(I84+(I86+I87+I88+I89)-H84,2)))","v":"N/D"},{"$f":"+IF(I84=0,\"N/D\",IF(ROUND(J84+(J86+J87+J88+J89)-I84,2)=0,\"OK\",ROUND(J84+(J86+J87+J88+J89)-I84,2)))","v":"N/D"},"N/D","N/D","N/D","N/D","N/D","N/D","N/D","N/D","N/D"]
[null,"jeśli [3] < 0 to sprawdź czy [4.1.1] + [4.2.1] + [4.3.1] + [4.4.1] + [3] = 0",null,"Kontrola poprawności wykazania źródeł pokrycia deficytu","x","x","x","x",{"$f":"IF(I23<0,IF(ROUND(I26+I28+I30+I32+I23,2)=0,\"OK\",ROUND(I26+I28+I30+I32+I23,2)),\"N/D\")","v":"OK"},{"$f":"IF(J23<0,IF(ROUND(J26+J28+J30+J32+J23,2)=0,\"OK\",ROUND(J26+J28+J30+J32+J23,2)),\"N/D\")","v":"N/D"},"N/D","N/D","N/D","N/D","N/D","N/D","N/D","N/D","N/D"]
[null,"jeśli [3] >= 0 to sprawdź czy [4.1.1]=0 i [4.2.1]=0 i [4.3.1]=0 i  [4.4.1] = 0",null,"Kontrola poprawności niewykazania źródeł pokrycia deficytu przy nadwyżce budżetu","x","x","x","x",{"$f":"IF(I23>=0,IF(ROUND(I26+I28+I30+I32,2)=0,\"OK\",ROUND(I26+I28+I30+I32,2)),\"N/D\")","v":"N/D"},{"$f":"IF(J23>=0,IF(ROUND(J26+J28+J30+J32,2)=0,\"OK\",ROUND(J26+J28+J30+J32,2)),\"N/D\")","v":"OK"},"OK","OK","OK","OK","OK","OK","OK","OK","OK"]
[null,"[1.1.3] >=  [1.1.3.1]",null,"Reguła logiczna:  [1.1.3] >=  [1.1.3.1]","x","x","x","x",{"$f":"IF(I8>=I9,\"OK\",\"BŁĄD\")","v":"OK"},"OK","OK","OK","OK","OK","OK","OK","OK","OK","OK"]
[null,"[1.1.5] >= [13.2]",null,"Reguła logiczna:  [1.1.5] >= [13.2]","x","x","x","x",{"$f":"IF(I11>=I85,\"OK\",\"BŁĄD\")","v":"OK"},"OK","OK","OK","OK","OK","OK","OK","OK","OK","OK"]
[null,"[1.1] >=  ([1.1.1] + [1.1.2] + [1.1.3] + [1.1.4] + [1.1.5])",null,"Reguła logiczna:  [1.1] >=  ([1.1.1] + [1.1.2] + [1.1.3] + [1.1.4] + [1.1.5])","x","x","x","x",{"$f":"IF(I5>=I6+I7+I8+I10+I11,\"OK\",\"BŁĄD\")","v":"OK"},"OK","OK","OK","OK","OK","OK","OK","OK","OK","OK"]
[null,"[1.1] >= [12.1]",null,"Reguła logiczna:  [1.1] >= [12.1]","x","x","x","x",{"$f":"IF(I5>=I71,\"OK\",\"BŁĄD\")","v":"OK"},"OK","OK","OK","OK","OK","OK","OK","OK","OK","OK"]
[null,"[1.2] >= [1.2.1]",null,"Reguła logiczna:  [1.2] >= [1.2.1]","x","x","x","x",{"$f":"IF(I12>=I13,\"OK\",\"BŁĄD\")","v":"OK"},"OK","OK","OK","OK","OK","OK","OK","OK","OK","OK"]
[null,"[1.2] >= [1.2.2]",null,"Reguła logiczna:  [1.2] >= [1.2.2]","x","x","x","x",{"$f":"IF(I12>=I14,\"OK\",\"BŁĄD\")","v":"OK"},"OK","OK","OK","OK","OK","OK","OK","OK","OK","OK"]
[null,"[1.2] >= [12.2]",null,"Reguła logiczna:  [1.2] >= [12.2]","x","x","x","x",{"$f":"IF(I12>=I74,\"OK\",\"BŁĄD\")","v":"OK"},"OK","OK","OK","OK","OK","OK","OK","OK","OK","OK"]
[null,null,null,"Reguła logiczna: jeżeli [3] >0 to [10] = [3]","x","x","x","x",{"$f":"+IF(I23>0,IF(I23=I59,\"OK\",\"Błąd\"),\"N/D\")","v":"N/D"},{"$f":"+IF(J23>0,IF(J23=J59,\"OK\",\"Błąd\"),\"N/D\")","v":"OK"},"OK","OK","OK","OK","OK","OK","OK","OK","OK"]
[null,"[10] >= [10.1]",null,"Reguła logiczna:  [10] >= [10.1]","x","x","x","x",{"$f":"IF(I59>=I60,\"OK\",\"BŁĄD\")","v":"OK"},"OK","OK","OK","OK","OK","OK","OK","OK","OK","OK"]
[null,null,null,"Reguła logiczna:  jeżeli [10] > 0 to [10.1] >0","x","x","x","x",{"$f":"IF(I59>0,IF(I60>0,\"OK\",\"BŁĄD\"),\"N/D\")","v":"N/D"},{"$f":"IF(J59>0,IF(J60>0,\"OK\",\"BŁĄD\"),\"N/D\")","v":"OK"},"OK","OK","OK","OK","OK","OK","OK","OK","OK"]
[null,"[12.1] >= [12.1.1]",null,"Reguła logiczna:  [12.1] >= [12.1.1]","x","x","x","x",{"$f":"IF(I71>=I72,\"OK\",\"BŁĄD\")","v":"OK"},"OK","OK","OK","OK","OK","OK","OK","OK","OK","OK"]
[null,"[12.1.1] >= [12.1.1.1]",null,"Reguła logiczna:  [12.1.1] >= [12.1.1.1]","x","x","x","x",{"$f":"IF(I72>=I73,\"OK\",\"BŁĄD\")","v":"OK"},"OK","OK","OK","OK","OK","OK","OK","OK","OK","OK"]
[null,"[12.2] >= [12.2.1]",null,"Reguła logiczna:  [12.2] >= [12.2.1]","x","x","x","x",{"$f":"IF(I74>=I75,\"OK\",\"BŁĄD\")","v":"OK"},"OK","OK","OK","OK","OK","OK","OK","OK","OK","OK"]
[null,"[12.2.1] >= [12.2.1.1]",null,"Reguła logiczna:  [12.2.1] >= [12.2.1.1]","x","x","x","x",{"$f":"IF(I75>=I76,\"OK\",\"BŁĄD\")","v":"OK"},"OK","OK","OK","OK","OK","OK","OK","OK","OK","OK"]
[null,"[12.3] >= [12.3.1]",null,"Reguła logiczna:  [12.3] >= [12.3.1]","x","x","x","x",{"$f":"IF(I77>=I78,\"OK\",\"BŁĄD\")","v":"OK"},"OK","OK","OK","OK","OK","OK","OK","OK","OK","OK"]
[null,"[12.3] >= [12.3.2]",null,"Reguła logiczna:  [12.3] >= [12.3.2]","x","x","x","x",{"$f":"IF(I77>=I79,\"OK\",\"BŁĄD\")","v":"OK"},"OK","OK","OK","OK","OK","OK","OK","OK","OK","OK"]
[null,"[12.4] >= [12.4.1]",null,"Reguła logiczna:  [12.4] >= [12.4.1]","x","x","x","x",{"$f":"IF(I80>=I81,\"OK\",\"BŁĄD\")","v":"OK"},"OK","OK","OK","OK","OK","OK","OK","OK","OK","OK"]
[null,"[12.4] >= [12.4.2]",null,"Reguła logiczna:  [12.4] >= [12.4.2]","x","x","x","x",{"$f":"IF(I80>=I82,\"OK\",\"BŁĄD\")","v":"OK"},"OK","OK","OK","OK","OK","OK","OK","OK","OK","OK"]
[null,"[13.1] >= [13.3]",null,"Reguła logiczna:  [13.1] >= [13.3]","x","x","x","x",{"$f":"IF(I84>=I86,\"OK\",\"BŁĄD\")","v":"OK"},"OK","OK","OK","OK","OK","OK","OK","OK","OK","OK"]
[null,"[13.4] >= [2.1.2]",null,"Reguła logiczna:  [13.4] >= [2.1.2]","x","x","x","x",{"$f":"IF(I87>=I19,\"OK\",\"BŁĄD\")","v":"OK"},"OK","OK","OK","OK","OK","OK","OK","OK","OK","OK"]
[null,"[14.3] >= [14.3.1] + [14.3.2] + [14.3.3]",null,"Reguła logiczna:  [14.3] >= [14.3.1] + [14.3.2] + [14.3.3]","x","x","x","x",{"$f":"IF(I94>=(I95+I96+I97),\"OK\",\"BŁĄD\")","v":"OK"},"OK","OK","OK","OK","OK","OK","OK","OK","OK","OK"]
[null,"[2.1.1] >= [2.1.1.1]",null,"Reguła logiczna:  [2.1.1] >= [2.1.1.1]","x","x","x","x",{"$f":"IF(I17>=I18,\"OK\",\"BŁĄD\")","v":"OK"},"OK","OK","OK","OK","OK","OK","OK","OK","OK","OK"]
[null,"[2.1.1] >= [14.3.3]",null,"Reguła logiczna:  [2.1.1] >= [14.3.3]","x","x","x","x",{"$f":"IF(I17>=I97,\"OK\",\"BŁĄD\")","v":"OK"},"OK","OK","OK","OK","OK","OK","OK","OK","OK","OK"]
[null,"[2.1.3] >= [2.1.3.1] ",null,"Reguła logiczna:  [2.1.3] >= [2.1.3.1] ","x","x","x","x",{"$f":"IF(I20>=I21,\"OK\",\"BŁĄD\")","v":"OK"},"OK","OK","OK","OK","OK","OK","OK","OK","OK","OK"]
[null,"[2.1] >= ([2.1.1] + [2.1.2] + [2.1.3])",null,"Reguła logiczna:  [2.1] >= ([2.1.1] + [2.1.2] + [2.1.3])","x","x","x","x",{"$f":"IF(I16>=(I17+I19+I20),\"OK\",\"BŁĄD\")","v":"OK"},"OK","OK","OK","OK","OK","OK","OK","OK","OK","OK"]
[null,"[2.1] >= [11.1]",null,"Reguła logiczna:  [2.1] >= [11.1]","x","x","x","x",{"$f":"IF(I16>=I62,\"OK\",\"BŁĄD\")","v":"OK"},"OK","OK","OK","OK","OK","OK","OK","OK","OK","OK"]
[null,"[2.1] >= [11.3.1]",null,"Reguła logiczna:  [2.1] >= [11.3.1]","x","x","x","x",{"$f":"IF(I16>=I65,\"OK\",\"BŁĄD\")","v":"OK"},"OK","OK","OK","OK","OK","OK","OK","OK","OK","OK"]
[null,"[2.1] >= [12.3]",null,"Reguła logiczna:  [2.1] >= [12.3]","x","x","x","x",{"$f":"IF(I16>=I77,\"OK\",\"BŁĄD\")","v":"OK"},"OK","OK","OK","OK","OK","OK","OK","OK","OK","OK"]
[null,"[2.1] >= [13.7]",null,"Reguła logiczna:  [2.1] >= [13.7]","x","x","x","x",{"$f":"IF(I16>=I90,\"OK\",\"BŁĄD\")","v":"OK"},"OK","OK","OK","OK","OK","OK","OK","OK","OK","OK"]
[null,"[2.2] >= [11.3.2]",null,"Reguła logiczna:  [2.2] >= [11.3.2]","x","x","x","x",{"$f":"IF(I22>=I66,\"OK\",\"BŁĄD\")","v":"OK"},"OK","OK","OK","OK","OK","OK","OK","OK","OK","OK"]
[null,"[2.2] >= [11.4] + [11.5]",null,"Reguła logiczna:  [2.2] >= [11.4] + [11.5]","x","x","x","x",{"$f":"IF(I22>=I67+I68,\"OK\",\"BŁĄD\")","v":"OK"},"OK","OK","OK","OK","OK","OK","OK","OK","OK","OK"]
[null,"[2.2] >= [11.6]",null,"Reguła logiczna:  [2.2] >= [11.6]","x","x","x","x",{"$f":"IF(I22>=I69,\"OK\",\"BŁĄD\")","v":"OK"},"OK","OK","OK","OK","OK","OK","OK","OK","OK","OK"]
[null,"[2.2] >= [12.4]",null,"Reguła logiczna:  [2.2] >= [12.4]","x","x","x","x",{"$f":"IF(I22>=I80,\"OK\",\"BŁĄD\")","v":"OK"},"OK","OK","OK","OK","OK","OK","OK","OK","OK","OK"]
[null,"[4.1] >= [4.1.1]",null,"Reguła logiczna:  [4.1] >= [4.1.1]","x","x","x","x",{"$f":"IF(I25>=I26,\"OK\",\"BŁĄD\")","v":"OK"},"OK","OK","OK","OK","OK","OK","OK","OK","OK","OK"]
[null,"[4.2] >= [4.2.1]",null,"Reguła logiczna:  [4.2] >= [4.2.1]","x","x","x","x",{"$f":"IF(I27>=I28,\"OK\",\"BŁĄD\")","v":"OK"},"OK","OK","OK","OK","OK","OK","OK","OK","OK","OK"]
[null,"[4.3] >= [4.3.1]",null,"Reguła logiczna:  [4.3] >= [4.3.1]","x","x","x","x",{"$f":"IF(I29>=I30,\"OK\",\"BŁĄD\")","v":"OK"},"OK","OK","OK","OK","OK","OK","OK","OK","OK","OK"]
[null,"[4.4] >= [4.4.1]",null,"Reguła logiczna:  [4.4] >= [4.4.1]","x","x","x","x",{"$f":"IF(I31>=I32,\"OK\",\"BŁĄD\")","v":"OK"},"OK","OK","OK","OK","OK","OK","OK","OK","OK","OK"]
[null,"[5.1] >= [5.1.1]",null,"Reguła logiczna:  [5.1] >= [5.1.1]","x","x","x","x",{"$f":"IF(I34>=I35,\"OK\",\"BŁĄD\")","v":"OK"},"OK","OK","OK","OK","OK","OK","OK","OK","OK","OK"]
[null,"[5.1.1] >= [5.1.1.1]",null,"Reguła logiczna:  [5.1.1] >= [5.1.1.1]","x","x","x","x",{"$f":"IF(I35>=I36,\"OK\",\"BŁĄD\")","v":"OK"},"OK","OK","OK","OK","OK","OK","OK","OK","OK","OK"]
[null,"[5.1] >= [10.1]",null,"Reguła logiczna:  [5.1] >= [10.1]","x","x","x","x",{"$f":"IF(I34>=I60,\"OK\",\"BŁĄD\")","v":"OK"},"OK","OK","OK","OK","OK","OK","OK","OK","OK","OK"]
[null,"[5.1] >= [14.1]",null,"Reguła logiczna:  [5.1] >= [14.1]","x","x","x","x",{"$f":"IF(I34>=I92,\"OK\",\"BŁĄD\")","v":"OK"},"OK","OK","OK","OK","OK","OK","OK","OK","OK","OK"]
[null,"[6] >= [6.1]",null,"Reguła logiczna:  [6] >= [6.1]","x","x","x","x",{"$f":"IF(I38>=I39,\"OK\",\"BŁĄD\")","v":"OK"},"OK","OK","OK","OK","OK","OK","OK","OK","OK","OK"]
[null,"[6] >=[7]",null,"Reguła logiczna:  [6] >=[7]","x","x","x","x",{"$f":"IF(I38>=I43,\"OK\",\"BŁĄD\")","v":"OK"},"OK","OK","OK","OK","OK","OK","OK","OK","OK","OK"]
[null,"[6] >= [14.2]",null,"Reguła logiczna:  [6] >= [14.2]","x","x","x","x",{"$f":"IF(I38>=I93,\"OK\",\"BŁĄD\")","v":"OK"},"OK","OK","OK","OK","OK","OK","OK","OK","OK","OK"]
[null,"[6.1] >= [6.1.1]",null,"Reguła logiczna:  [6.1] >= [6.1.1]","x","x","x","x",{"$f":"+IF(I39>=I40,\"OK\",\"BŁĄD\")","v":"OK"},"OK","OK","OK","OK","OK","OK","OK","OK","OK","OK"]
[null,"7>=13.1",null,"Reguła logiczna:  7>=13.1","x","x","x","x",{"$f":"IF(I43>=I84,\"OK\",\"BŁĄD\")","v":"OK"},"OK","OK","OK","OK","OK","OK","OK","OK","OK","OK"]
[null,"jeżeli [2.1.3] <> 0 to  [2.1.3.1] <> 0 ",null,"Reguła logiczna:  jeżeli [2.1.3] <> 0 to  [2.1.3.1] <> 0 ","x","x","x","x",{"$f":"IF(I20<>0,IF(I21<>0,\"OK\",\"BŁĄD\"),\"N/D\")","v":"OK"},"OK","OK","OK","OK","OK","OK","OK","OK","OK","OK"]
[]
[null,null,null,"Kontrola poprawności podstawowych kwot"]
[null,null,null,"Dochody ogółem = bieżące + majątkowe",{"$f":"E5+E12","v":31484876.009999998},31063442.330000002,35624119.93,34438420.270000003,37144207.170000002,31500000.710000001,31500000,31500000,32000000,32500000,33000000,33500000,34000000,34500000,35000000]
[null,null,null,"Wydatki ogółem = bieżące + majątkowe",{"$f":"E16+E22","v":34609335.700000003},31037203.93,40495660.859999999,36384626.189999998,39751618.390000001,30561940.549999997,30284308,29934304,30084300,30821796,31389996,31889996,32389996,32849996,33290000]
[null,null,null,"Wynik budżetu = dochody ogółem - wydatki ogółem",{"$f":"E4-E15","v":-3124459.6900000013},26238.39999999851,-4871540.93,-1946205.9199999943,-2607411.2199999988,938060.16000000015,1215692,1565696,1915700,1678204,1610004,1610004,1610004,1650004,1710000]
[null,null,null,"Wyliczenie kwoty długu","x",{"$f":"E38+F29-F34+(F93-E93)+F98","v":13906544.860000001},"x",{"$f":"F38+H29-H34+(H93-F93)+H98","v":15503368.16},{"$f":"H38+I29-I34+(I93-H93)+I98","v":15503368.16},14565308,13349616,11783920,9868220,8190016,6580012,4970008,3360004,1710000,0]
[null,null,null,"Wyliczenie zobowiązań wynikających z przejęcia przez jst zobowiązań po likwidowanych i przekształcanych SZOZ","x",{"$f":"E84-(F86+F87+F88+F89)","v":0},"x",{"$f":"F84-(H86+H87+H88+H89)","v":0},{"$f":"H84-(I86+I87+I88+I89)","v":0},{"$f":"I84-(J86+J87+J88+J89)","v":0},0,0,0,0,0,0,0,0,0]
[]
[null,null,null,"Analiza ryzyka niespełnienia wskaźnika z art. 243"]
[null,null,null,"Analiza składowych wzoru wskaźnika z art. 243"]
[null,null,null,0,{"$f":"+\"różnica mniejsza od \"&TEXT(D178*100,\"0,0\")&\"%\"","v":"różnica mniejsza od 0,0%"}]
[null,null,null,5.0000000000000001E-3,{"$f":"+\"różnica mniejsza od \"&TEXT(D179*100,\"0,0\")&\"%\"","v":"różnica mniejsza od 0,5%"}]
[null,null,null,0.01,{"$f":"+\"różnica mniejsza od \"&TEXT(D180*100,\"0,0\")&\"%\"","v":"różnica mniejsza od 1,0%"}]
[null,null,null,"max. limit spłat (planistyczny) - (R+O)/D (bez wyłączeń)","x","x","x","x",{"$f":"+IF(I4=0,\"\",I55-I50)","v":-9.1900000000000009E-2},-8.9000000000000051E-3,7.7999999999999944E-3,3.7000000000000005E-2,6.1200000000000004E-2,6.6799999999999998E-2,6.9500000000000006E-2,7.2999999999999982E-2,7.5099999999999986E-2,7.6899999999999996E-2,7.6800000000000007E-2]
[null,null,null,"max. limit spłat (planistyczny) - (R+O)/D (z wyłączeniami)","x","x","x","x",{"$f":"+IF(I4=0,\"\",I55-I51)","v":-9.1900000000000009E-2},-8.9000000000000051E-3,7.7999999999999944E-3,3.7000000000000005E-2,6.1200000000000004E-2,6.6799999999999998E-2,6.9500000000000006E-2,7.2999999999999982E-2,7.5099999999999986E-2,7.6899999999999996E-2,7.6800000000000007E-2]
[null,null,null,"max. limit spłat (wg wykonania) - (R+O)/D (bez wyłączeń)","x","x","x","x",{"$f":"+IF(I4=0,\"\",I56-I50)","v":-7.2400000000000006E-2},1.0599999999999998E-2,2.7400000000000001E-2,3.7000000000000005E-2,6.1200000000000004E-2,6.6799999999999998E-2,6.9500000000000006E-2,7.2999999999999982E-2,7.5099999999999986E-2,7.6899999999999996E-2,7.6800000000000007E-2]
[null,null,null,"max. limit spłat (wg wykonania) - (R+O)/D (z wyłączeniami)","x","x","x","x",{"$f":"+IF(I4=0,\"\",I56-I51)","v":-7.2400000000000006E-2},1.0599999999999998E-2,2.7400000000000001E-2,3.7000000000000005E-2,6.1200000000000004E-2,6.6799999999999998E-2,6.9500000000000006E-2,7.2999999999999982E-2,7.5099999999999986E-2,7.6899999999999996E-2,7.6800000000000007E-2]
[null,null,null,"DYNAMIKA podstawowych wielkości z prognozy"]
[null,null,null,0.05,{"$f":"+\"zmiana większa niż +/- \"&TEXT(D186*100,\"0,0\")&\"%\"","v":"zmiana większa niż +/- 5,0%"}]
[null,null,null,0.1,{"$f":"+\"zmiana większa niż +/- \"&TEXT(D187*100,\"0,0\")&\"%\"","v":"zmiana większa niż +/- 10,0%"}]
[null,null,null,0.2,{"$f":"+\"zmiana większa niż +/- \"&TEXT(D188*100,\"0,0\")&\"%\"","v":"zmiana większa niż +/- 20,0%"},null,"[N-1]pl3kw / [N-2]","[N-1]wyk \n/ [N-1]pl3kw"]
[null,null,null,"Dochody ogółem","-",{"$f":"+IF(F4=0,0,IF(E215<>0,F215/E215-1,0))","v":-1.3385273610928339E-2},0.14681816495255129,-3.3283619702882516E-2,7.8568844876925503E-2,-0.15195388164210477,-2.2539682009714568E-8,0,1.5873015873015817E-2,1.5625E-2,1.538461538461533E-2,1.5151515151515138E-2,1.4925373134328401E-2,1.4705882352941124E-2,1.449275362318847E-2]
[null,null,null,"dochody ogółem bez środków UE (fin. i współfin.)","-",{"$f":"+IF(F4=0,0,IF(E216<>0,F216/E216-1,0))","v":-1.3385273610928339E-2},0.14681816495255129,-5.9428557229203038E-2,-4.2745442527417521E-2,-2.4859145729723031E-2,7.1167666525797646E-3,0,1.5873015873015817E-2,1.5625E-2,1.538461538461533E-2,1.5151515151515138E-2,1.4925373134328401E-2,1.4705882352941124E-2,1.449275362318847E-2]
[null,null,null,"dochody bieżące bez środków UE (fin. i współfin.)","-",{"$f":"+IF(F4=0,0,IF(E217<>0,F217/E217-1,0))","v":9.7270634448407334E-2},5.2907478261852381E-2,-4.777515524949949E-2,7.1037097192557574E-2,2.514944524559759E-2,7.1167666525797646E-3,0,1.5873015873015817E-2,1.5625E-2,1.538461538461533E-2,1.5151515151515138E-2,1.4925373134328401E-2,1.4705882352941124E-2,1.449275362318847E-2]
[null,null,null,"dochody majątkowe bez środków UE (fin. i współfin.)","-",{"$f":"+IF(F4=0,0,IF(E218<>0,F218/E218-1,0))","v":-0.52586146518772714},1.1533386239627186,-0.12050000256814741,-0.68834728353318253,-1,0,0,0,0,0,0,0,0,0]
[null,null,null,"dochody majątkowe bez środków UE (fin. i współfin.) \ni bez sprzedaży majątku","-",{"$f":"+IF(F4=0,0,IF(E219<>0,F219/E219-1,0))","v":-0.38293911945032866},1.1365760684894708,-0.13332690119064161,-0.70381238398030121,-1,0,0,0,0,0,0,0,0,0]
[null,null,null,"dochody ze sprzedaży majątku","-",{"$f":"+IF(F4=0,0,IF(E220<>0,F220/E220-1,0))","v":-0.98055122157830699},2.8453019638726191,0.59888320000000017,-0.21820430660601098,-1,0,0,0,0,0,0,0,0,0]
[null,null,null,"Wydatki ogółem","-",{"$f":"+IF(F4=0,0,IF(E221<>0,F221/E221-1,0))","v":-0.10321295389671414},0.30474578030070631,-0.1015179054420795,9.2538870192526268E-2,-0.23117745169116877,-9.0842579039046578E-3,-1.1557272499011728E-2,5.0108397375800973E-3,2.4514314775480939E-2,1.8435006188477709E-2,1.5928641723942816E-2,1.5678898172329703E-2,1.4201915924904718E-2,1.3394339530513166E-2]
[null,null,null,"wydatki ogółem bez wydatków na projekty finansowane i współfinansowane środkami UE","-",{"$f":"+IF(F4=0,0,IF(E222<>0,F222/E222-1,0))","v":-0.10321295389671414},0.30474578030070631,-0.1015179054420795,1.8059222501524586E-2,-0.182008333215392,-5.1146863141249277E-4,-1.1557272499011728E-2,5.0108397375800973E-3,2.4514314775480939E-2,1.8435006188477709E-2,1.5928641723942816E-2,1.5678898172329703E-2,1.4201915924904718E-2,1.3394339530513166E-2]
[null,null,null,"wydatki bieżące ogółem","-",{"$f":"+IF(F4=0,0,IF(E223<>0,F223/E223-1,0))","v":3.6559159667944652E-2},0.11822943137077679,-8.3285250897701446E-2,0.17016489804008161,-0.14242354024506465,1.0084657315749368E-2,9.944751381215422E-3,1.3493800145878865E-2,1.5833033465275204E-2,1.5586255756287581E-2,1.6393442622950838E-2,1.6129032258064502E-2,1.5197568389057725E-2,1.6633399866932796E-2]
[null,null,null,"wydatki bieżące ogółem bez wydatków na projekty współfinansowane środkami UE","-",{"$f":"+IF(F4=0,0,IF(E224<>0,F224/E224-1,0))","v":3.6559159667944652E-2},0.11822943137077679,-8.3285250897701446E-2,9.6433444019661918E-2,-9.368028933143302E-2,2.0032460701511878E-2,9.944751381215422E-3,1.3493800145878865E-2,1.5833033465275204E-2,1.5586255756287581E-2,1.6393442622950838E-2,1.6129032258064502E-2,1.5197568389057725E-2,1.6633399866932796E-2]
[null,null,null,"wydatki bieżące na wynagrodzenia i składki od nich naliczane","-",{"$f":"+IF(F4=0,0,IF(E225<>0,F225/E225-1,0))","v":-1},0,-1.6080881175560724E-2,4.7839286545970472E-2,-1.4404321868841996E-2,3.2258064516129004E-2,1.5625E-2,1.538461538461533E-2,1.5151515151515138E-2,1.4925373134328401E-2,1.4705882352941124E-2,1.449275362318847E-2,1.7928571428571516E-2,1.7472458073117592E-2]
[null,null,null,"pozostałe wydatki bieżące (wydatki bieżące bez wynagrodzeń i pochodnych oraz wydatków związanych z funkcjonowaniem organów jst, wydatków na obsługę długu  oraz poręczeń i gwarancji)","-",{"$f":"+IF(F4=0,0,IF(E226<>0,F226/E226-1,0))","v":0.83489753148047785},-0.36426559076694032,-0.13291107872408003,6.6183214433877868E-2,-0.27800482879340804,-1.7269087944678296E-2,2.4572346659106348E-3,1.310455359668139E-2,1.9356039456541962E-2,1.8623333941939046E-2,2.1061122064886195E-2,2.027560782936888E-2,1.7033723331039141E-2,1.7763491794958508E-2]
[null,null,null,"WIELKOŚĆ ZMIAN w podstawowych kwotach prognozy",null,null,"[N-1]pl3kw \n- [N-2]","[N-1]wyk \n- [N-1]pl3kw"]
[null,null,null,"Dochody ogółem","-",{"$f":"+IF(F$215=0,\"\",F215-E215)","v":-421433.68000000343},{"$f":"+IF(G$215=0,\"\",G215-F215)","v":4560677.6000000015},{"$f":"+IF(H$215=0,\"\",H215-G215)","v":-1185699.6599999964},{"$f":"+IF(I$215=0,\"\",I215-H215)","v":2705786.8999999985},-5644206.4600000009,-0.71000000089406967,0,500000,500000,500000,500000,500000,500000,500000]
[null,null,null,"dochody ogółem bez środków UE (fin. i współfin.)","-",-421433.68000000343,4560677.6000000015,-2117090.049999997,{"$f":"+IF(I$215=0,\"\",I216-H216)","v":-1432272.8200000003},-797351.06000000238,222594,0,500000,500000,500000,500000,500000,500000,500000]
[null,null,null,"dochody bieżące bez środków UE (fin. i współfin.)","-",2518705.0100000016,1503233.2599999979,-1429228.379999999,{"$f":"+IF(I$215=0,\"\",I217-H217)","v":2023597.9899999984},767311.94000000134,222594,0,500000,500000,500000,500000,500000,500000,500000]
[null,null,null,"dochody majątkowe bez środków UE (fin. i współfin.)","-",-2940138.69,3057444.3400000003,-687861.67000000086,{"$f":"+IF(I$215=0,\"\",I218-H218)","v":-3455870.8099999991},-1564663.0000000005,0,0,0,0,0,0,0,0,0]
[null,null,null,"dochody majątkowe bez środków UE (fin. i współfin.) \ni bez sprzedaży majątku","-",-1629003.4,2983450.1,-747749.99000000115,{"$f":"+IF(I$215=0,\"\",I219-H219)","v":-3420982.4899999988},-1439663.0000000005,0,0,0,0,0,0,0,0,0]
[null,null,null,"dochody ze sprzedaży majątku","-",-1311135.29,73994.240000000005,59888.320000000007,{"$f":"+IF(I$215=0,\"\",I220-H220)","v":-34888.320000000007},-125000,0,0,0,0,0,0,0,0,0]
[null,null,null,"Wydatki ogółem","-",{"$f":"+IF(F$221=0,\"\",F221-E221)","v":-3572131.7700000033},{"$f":"+IF(G$221=0,\"\",G221-F221)","v":9458456.9299999997},{"$f":"+IF(H$221=0,\"\",H221-G221)","v":-4111034.6700000018},{"$f":"+IF(I$221=0,\"\",I221-H221)","v":3366992.200000003},{"$f":"+IF(J$221=0,\"\",J221-I221)","v":-9189677.8399999999},-277632.55000000075,-350004,149996,737496,568200,500000,500000,460000,440004]
[null,null,null,"wydatki ogółem bez wydatków na projekty finansowane i współfinansowane środkami UE","-",-3572131.7700000033,9458456.9299999997,-4111034.6700000018,657078.06000000983,{"$f":"+IF(J$221=0,\"\",J222-I222)","v":-6741898.8500000052},-15497.400000002235,-350004,149996,737496,568200,500000,500000,460000,440004]
[null,null,null,"wydatki bieżące ogółem","-",921571.67000000179,3089246.8000000007,-2433470.1400000006,4557871.9499999993,-4463967.1000000015,271064.85000000149,270000,370000,440000,440000,470000,470000,450000,500000]
[null,null,null,"wydatki bieżące ogółem bez wydatków na projekty współfinansowane środkami UE","-",921571.67000000179,3089246.8000000007,-2433470.1400000006,2582972.7199999988,-2751203.0199999996,533200,270000,370000,440000,440000,470000,470000,450000,500000]
[null,null,null,"wydatki bieżące na wynagrodzenia i składki od nich naliczane","-",-10915139.42,12203062,-196235.99000000022,574397.99000000022,-181224,400000,200000,200000,200000,200000,200000,200000,251000,249000]
[null,null,null,"pozostałe wydatki bieżące (wydatki bieżące bez wynagrodzeń i pochodnych oraz wydatków związanych z funkcjonowaniem organów jst, wydatków na obsługę długu  oraz poręczeń i gwarancji)","-",11545373.000000002,-9242825.5599999987,-2143993.7200000007,925707.58000000007,-4145817.1500000022,-185935.14999999851,26000,139000,208000,204000,235000,231000,198000,210000]
[null,null,null,"PODSTAWOWE wielkości ujęte w prognozie"]
[null,null,null,"Dochody ogółem",{"$f":"+E4","v":31484876.010000002},{"$f":"+F4","v":31063442.329999998},{"$f":"+G4","v":35624119.93},{"$f":"+H4","v":34438420.270000003},{"$f":"+I4","v":37144207.170000002},31500000.710000001,31500000,31500000,32000000,32500000,33000000,33500000,34000000,34500000,35000000]
[null,null,null,"dochody ogółem bez środków UE (fin. i współfin.)",{"$f":"+(E4-E71-E74)","v":31484876.010000002},{"$f":"+(F4-F71-F74)","v":31063442.329999998},{"$f":"+(G4-G71-G74)","v":35624119.93},{"$f":"+(H4-H71-H74)","v":33507029.880000003},{"$f":"+(I4-I71-I74)","v":32074757.060000002},{"$f":"+(J4-J71-J74)","v":31277406},31500000,31500000,32000000,32500000,33000000,33500000,34000000,34500000,35000000]
[null,null,null,"dochody bieżące bez środków UE (fin. i współfin.)",{"$f":"+E5-E71","v":25893786.18},{"$f":"+F5-F71","v":28412491.190000001},{"$f":"+G5-G71","v":29915724.449999999},{"$f":"+H5-H71","v":28486496.07},{"$f":"+I5-I71","v":30510094.059999999},{"$f":"+J5-J71","v":31277406},31500000,31500000,32000000,32500000,33000000,33500000,34000000,34500000,35000000]
[null,null,null,"dochody majątkowe bez środków UE (fin. i współfin.)",{"$f":"+E12-E74","v":5591089.8300000001},{"$f":"+F12-F74","v":2650951.14},{"$f":"+G12-G74","v":5708395.4800000004},{"$f":"+H12-H74","v":5020533.8099999996},{"$f":"+I12-I74","v":1564663.0000000005},{"$f":"+J12-J74","v":0},0,0,0,0,0,0,0,0,0]
[null,null,null,"dochody majątkowe bez środków UE (fin. i współfin.) \ni bez sprzedaży majątku",{"$f":"+E12-E74-E13","v":4253948.78},{"$f":"+F12-F74-F13","v":2624945.3800000004},{"$f":"+G12-G74-G13","v":5608395.4800000004},{"$f":"+H12-H74-H13","v":4860645.4899999993},{"$f":"+I12-I74-I13","v":1439663.0000000005},{"$f":"+J12-J74-J13","v":0},0,0,0,0,0,0,0,0,0]
[null,null,null,"dochody ze sprzedaży majątku",{"$f":"+E13","v":1337141.05},{"$f":"+F13","v":26005.759999999998},{"$f":"+G13","v":100000},{"$f":"+H13","v":159888.32000000001},{"$f":"+I13","v":125000},{"$f":"+J13","v":0},0,0,0,0,0,0,0,0,0]
[null,null,null,"Wydatki ogółem",{"$f":"+E15","v":34609335.700000003},{"$f":"+F15","v":31037203.93},{"$f":"+G15","v":40495660.859999999},{"$f":"+H15","v":36384626.189999998},{"$f":"+I15","v":39751618.390000001},{"$f":"+J15","v":30561940.550000001},30284308,29934304,30084300,30821796,31389996,31889996,32389996,32849996,33290000]
[null,null,null,"wydatki ogółem bez wydatków na projekty finansowane i współfinansowane środkami UE",{"$f":"+E15-E77-E80","v":34609335.700000003},{"$f":"+F15-F77-F80","v":31037203.93},{"$f":"+G15-G77-G80","v":40495660.859999999},{"$f":"+H15-H77-H80","v":36384626.189999998},{"$f":"+I15-I77-I80","v":37041704.250000007},{"$f":"+J15-J77-J80","v":30299805.400000002},30284308,29934304,30084300,30821796,31389996,31889996,32389996,32849996,33290000]
[null,null,null,"wydatki bieżące ogółem",{"$f":"+E16","v":25207681.969999999},{"$f":"+F16","v":26129253.640000001},{"$f":"+G16","v":29218500.440000001},{"$f":"+H16","v":26785030.300000001},{"$f":"+I16","v":31342902.25},{"$f":"+J16","v":26878935.149999999},27150000,27420000,27790000,28230000,28670000,29140000,29610000,30060000,30560000]
[null,null,null,"wydatki bieżące ogółem bez wydatków na projekty współfinansowane środkami UE",{"$f":"+E16-E77","v":25207681.969999999},{"$f":"+F16-F77","v":26129253.640000001},{"$f":"+G16-G77","v":29218500.440000001},{"$f":"+H16-H77","v":26785030.300000001},{"$f":"+I16-I77","v":29368003.02},{"$f":"+J16-J77","v":26616800},27150000,27420000,27790000,28230000,28670000,29140000,29610000,30060000,30560000]
[null,null,null,"wydatki bieżące na wynagrodzenia i składki od nich naliczane",{"$f":"+E62","v":10915139.42},{"$f":"+F62","v":0},{"$f":"+G62","v":12203062},{"$f":"+H62","v":12006826.01},{"$f":"+I62","v":12581224},{"$f":"+J62","v":12400000},12800000,13000000,13200000,13400000,13600000,13800000,14000000,14251000,14500000]
[null,null,null,"pozostałe wydatki bieżące (wydatki bieżące bez wynagrodzeń i pochodnych oraz wydatków związanych z funkcjonowaniem organów jst, wydatków na obsługę długu  oraz poręczeń i gwarancji)",{"$f":"+E16-E17-E20-E62-E63","v":13828490.999999998},{"$f":"+F16-F17-F20-F62-F63","v":25373864},{"$f":"+G16-G17-G20-G62-G63","v":16131038.440000001},{"$f":"+H16-H17-H20-H62-H63","v":13987044.720000001},{"$f":"+I16-I17-I20-I62-I63","v":14912752.300000001},{"$f":"+J16-J17-J20-J62-J63","v":10766935.149999999},10581000,10607000,10746000,10954000,11158000,11393000,11624000,11822000,12032000]
[]
[null,null,null,"DYNAMIKA kwot ujętych w WPF ",null,null,"[N-1]pl3kw : [N-2]","[N-1]wyk / [N-2]"]
["x",1,"Dochody ogółem","Dochody ogółem","x",{"$f":"+IF(ISNONTEXT(E4),IF(E4<>0,F4/E4-1,\"\"),\"\")","v":-1.3385273610928339E-2},0.14681816495255129,{"$f":"+IF(ISNONTEXT(F4),IF(F4<>0,H4/F4-1,\"\"),\"\")","v":0.10864790528191293},{"$f":"+IF(ISNONTEXT(H4),IF(H4<>0,I4/H4-1,\"\"),\"\")","v":7.8568844876925503E-2},-0.15195388164210477,-2.2539682009714568E-8,0,1.5873015873015817E-2,1.5625E-2,1.538461538461533E-2,1.5151515151515138E-2,1.4925373134328401E-2,1.4705882352941124E-2,1.449275362318847E-2]
["x","1.1","Dochody bieżące","Dochody bieżące, w tym:","x",9.7270634448407334E-2,5.2907478261852381E-2,3.5385678196139914E-2,{"$f":"+IF(ISNONTEXT(H5),IF(H5<>0,I5/H5-1,\"\"),\"\")","v":0.10374563632060463},-2.9869638680199873E-2,-2.2539682009714568E-8,0,1.5873015873015817E-2,1.5625E-2,1.538461538461533E-2,1.5151515151515138E-2,1.4925373134328401E-2,1.4705882352941124E-2,1.449275362318847E-2]
[null,"1.1.1","dochody z tytułu udziału we wpływach z podatku dochodowego od osób fizycznych","dochody z tytułu udziału we wpływach z podatku dochodowego od osób fizycznych","x","","","",{"$f":"+IF(ISNONTEXT(H6),IF(H6<>0,I6/H6-1,\"\"),\"\")","v":""},4.4776119402984982E-2,4.2857142857142927E-2,4.1095890410958846E-2,3.9473684210526327E-2,3.7974683544303778E-2,3.6585365853658569E-2,3.529411764705892E-2,3.4090909090909172E-2,3.2967032967033072E-2,3.1914893617021267E-2]
[null,"1.1.2","dochody z tytułu udziału we wpływach z podatku dochodowego od osób prawnych","dochody z tytułu udziału we wpływach z podatku dochodowego od osób prawnych","x","","","",{"$f":"+IF(ISNONTEXT(H7),IF(H7<>0,I7/H7-1,\"\"),\"\")","v":""},0,4.1666666666666741E-2,4.0000000000000036E-2,7.6923076923076872E-2,7.1428571428571397E-2,6.6666666666666652E-2,6.25E-2,5.8823529411764719E-2,5.555555555555558E-2,5.2631578947368363E-2]
[null,"1.1.3","podatki i opłaty, w tym:","podatki i opłaty, w tym:","x","","","",{"$f":"+IF(ISNONTEXT(H8),IF(H8<>0,I8/H8-1,\"\"),\"\")","v":""},7.6234415677230105E-2,2.3809523809523725E-2,2.3255813953488413E-2,2.2727272727272707E-2,2.2222222222222143E-2,2.1739130434782705E-2,2.1276595744680771E-2,2.0833333333333259E-2,2.0408163265306145E-2,2.0000000000000018E-2]
[null,"1.1.3.1","z podatku od nieruchomości","z podatku od nieruchomości","x","","","",{"$f":"+IF(ISNONTEXT(H9),IF(H9<>0,I9/H9-1,\"\"),\"\")","v":""},4.7614537376240884E-2,5.1282051282051322E-2,4.8780487804878092E-2,4.6511627906976827E-2,4.4444444444444509E-2,4.2553191489361764E-2,4.081632653061229E-2,3.9215686274509887E-2,3.7735849056603765E-2,3.6363636363636376E-2]
[null,"1.1.4","z subwencji ogólnej","z subwencji ogólnej","x","","","",{"$f":"+IF(ISNONTEXT(H10),IF(H10<>0,I10/H10-1,\"\"),\"\")","v":""},7.1459375885628118E-2,-3.125E-2,1.9354838709677358E-2,1.8987341772152E-2,1.8633540372670732E-2,1.8292682926829285E-2,1.7964071856287456E-2,2.3529411764705799E-2,2.2988505747126409E-2,2.2471910112359605E-2]
[null,"1.1.5","z tytułu dotacji i środków przeznaczonych na cele bieżące","z tytułu dotacji i środków przeznaczonych na cele bieżące","x","","","",{"$f":"+IF(ISNONTEXT(H11),IF(H11<>0,I11/H11-1,\"\"),\"\")","v":""},-0.28588036188741062,1.6666666666666607E-2,1.6393442622950838E-2,1.6129032258064502E-2,1.5873015873015817E-2,1.5625E-2,1.538461538461533E-2,1.5151515151515138E-2,1.4925373134328401E-2,1.4705882352941124E-2]
["x","1.2","Dochody majątkowe","Dochody majątkowe, w tym:","x",-0.52586146518772714,1.1533386239627186,0.89386131424512016,{"$f":"+IF(ISNONTEXT(H12),IF(H12<>0,I12/H12-1,\"\"),\"\")","v":-6.8954908601641218E-2},-1,"","","","","","","","",""]
["x","1.2.1","Dochody ze sprzedaży majątku","ze sprzedaży majątku","x",-0.98055122157830699,2.8453019638726191,5.1481887089629383,{"$f":"+IF(ISNONTEXT(H13),IF(H13<>0,I13/H13-1,\"\"),\"\")","v":-0.21820430660601098},-1,"","","","","","","","",""]
[null,"1.2.2","z tytułu dotacji oraz środków przeznaczonych na inwestycje","z tytułu dotacji oraz środków przeznaczonych na inwestycje","x","","","",{"$f":"+IF(ISNONTEXT(H14),IF(H14<>0,I14/H14-1,\"\"),\"\")","v":""},-1,"","","","","","","","",""]
["x",2,"Wydatki ogółem","Wydatki ogółem","x",-0.10321295389671414,0.30474578030070631,0.17229072155018699,{"$f":"+IF(ISNONTEXT(H15),IF(H15<>0,I15/H15-1,\"\"),\"\")","v":9.2538870192526268E-2},-0.23117745169116877,-9.0842579039046578E-3,-1.1557272499011728E-2,5.0108397375800973E-3,2.4514314775480939E-2,1.8435006188477709E-2,1.5928641723942816E-2,1.5678898172329703E-2,1.4201915924904718E-2,1.3394339530513166E-2]
["x","2.1","Wydatki bieżące","Wydatki bieżące, w tym:","x",3.6559159667944652E-2,0.11822943137077679,2.5097412617867576E-2,{"$f":"+IF(ISNONTEXT(H16),IF(H16<>0,I16/H16-1,\"\"),\"\")","v":0.17016489804008161},-0.14242354024506465,1.0084657315749368E-2,9.944751381215422E-3,1.3493800145878865E-2,1.5833033465275204E-2,1.5586255756287581E-2,1.6393442622950838E-2,1.6129032258064502E-2,1.5197568389057725E-2,1.6633399866932796E-2]
["x","2.1.1","z tytułu poręczeń i gwarancji","z tytułu poręczeń i gwarancji, w tym:","x","","","",{"$f":"+IF(ISNONTEXT(H17),IF(H17<>0,I17/H17-1,\"\"),\"\")","v":""},"",0,0,0,0,0,0,-8.181818181818179E-2,-0.41584158415841588,0]
["x","2.1.1.1","gwarancje i poręczenia podlegające wyłączeniu z limitów spłaty zobowiązań określonych w art. 243 ust. 3 pkt 2 ustawy z dnia 27 sierpnia 2009 r. o finansach publicznych (Dz. U. Nr 157, poz. 1240, z późn. zm.) lub art. 169 ust. 3 pkt 2 ustawy z dnia 30 czerwca 2005 r. o finansach publicznych (Dz. U. Nr 249, poz. 2104, z późn. zm)","gwarancje i poręczenia podlegające wyłączeniu z limitów spłaty zobowiązań określonych w art. 243 ust. 3 pkt 2 ustawy z dnia 27 sierpnia 2009 r. o finansach publicznych (Dz. U. Nr 157, poz. 1240, z późn. zm.) lub art. 169 ust. 3 pkt 2 ustawy z dnia 30 czerwca 2005 r. o finansach publicznych (Dz. U. Nr 249, poz. 2104, z późn. zm)","x","","","",{"$f":"+IF(ISNONTEXT(H18),IF(H18<>0,I18/H18-1,\"\"),\"\")","v":""},"","","","","","","","","",""]
[null,"2.1.2","na spłatę przejętych zobowiązań samodzielnego publicznego zakładu opieki zdrowotnej przekształconego na zasadach określonych w przepisach o działalności leczniczej, w wysokości w jakiej nie podlegają sfinansowaniu dotacją z budżetu państwa)","na spłatę przejętych zobowiązań samodzielnego publicznego zakładu opieki zdrowotnej przekształconego na zasadach określonych w przepisach o działalności leczniczej, w wysokości w jakiej nie podlegają sfinansowaniu dotacją z budżetu państwa)","x","","","",{"$f":"+IF(ISNONTEXT(H19),IF(H19<>0,I19/H19-1,\"\"),\"\")","v":""},"","","","","","","","","",""]
["x","2.1.3","Wydatki na obsługę długu","wydatki na obsługę długu, w tym:","x",0.62781406505376403,0.17078650959523345,4.7352952841661855E-2,{"$f":"+IF(ISNONTEXT(H20),IF(H20<>0,I20/H20-1,\"\"),\"\")","v":-0.1152227356612775},-0.14000000000000001,-7.1428571428571397E-2,-0.10017889087656529,-0.13717693836978129,-0.15668202764976957,-0.17486338797814205,-0.21523178807947019,-0.21940928270042193,-0.30810810810810807,-0.4609375]
["x","2.1.3.1","odsetki i dyskonto określone w art. 243 ust. 1 ustawy lub art. 169 ust. 1 ufp z 2005 r..","odsetki i dyskonto określone w art. 243 ust. 1 ustawy lub art. 169 ust. 1 ufp z 2005 r..","x",0.62781406505376403,0.17078650959523345,4.7352952841661855E-2,{"$f":"+IF(ISNONTEXT(H21),IF(H21<>0,I21/H21-1,\"\"),\"\")","v":-0.1152227356612775},-0.14000000000000001,-7.1428571428571397E-2,-0.10017889087656529,-0.13717693836978129,-0.15668202764976957,-0.17486338797814205,-0.21523178807947019,-0.21940928270042193,-0.30810810810810807,-0.4609375]
["x","2.2","Wydatki majątkowe","Wydatki majątkowe","x",-0.47796946888832081,1.2977332192987636,0.95592769339153194,{"$f":"+IF(ISNONTEXT(H22),IF(H22<>0,I22/H22-1,\"\"),\"\")","v":-0.1240551960359656},-0.56200145911929911,-0.14898088392702324,-0.19781208483658907,-8.7500954538512477E-2,0.12966743669092962,4.9463769525070589E-2,1.1029427984452944E-2,1.0909106776882505E-2,3.5971274778812123E-3,-2.1503973482399297E-2]
["x",3,"Wynik budżetu","Wynik budżetu","x",-1.0083977399625212,-186.66455767119945,-75.173955729007858,{"$f":"+IF(ISNONTEXT(H23),IF(H23<>0,I23/H23-1,\"\"),\"\")","v":0.33974066834613281},-1.3597668648522576,0.29596378978508153,0.28790516018860046,0.22354531147809031,-0.12397348227801852,-4.0638682782307756E-2,0,0,2.4844658771034034E-2,3.6361123973032816E-2]
["x",4,"Przychody budżetu","Przychody budżetu","x",{"$f":"+IF(ISNONTEXT(E24),IF(E24<>0,F24/E24-1,\"\"),\"\")","v":-0.4},0.88209470277777768,0.79355384444444432,{"$f":"+IF(ISNONTEXT(H24),IF(H24<>0,I24/H24-1,\"\"),\"\")","v":0.1332886570837144},-1,"","","","","","","","",""]
["x","4.1","Nadwyżka budżetowa z lat ubiegłych, w tym:","Nadwyżka budżetowa z lat ubiegłych, w tym:","x","","","",{"$f":"+IF(ISNONTEXT(H25),IF(H25<>0,I25/H25-1,\"\"),\"\")","v":""},"","","","","","","","","",""]
["x","4.1.1","na pokrycie deficytu budżetu","na pokrycie deficytu budżetu","x","","","",{"$f":"+IF(ISNONTEXT(H26),IF(H26<>0,I26/H26-1,\"\"),\"\")","v":""},"","","","","","","","","",""]
["x","4.2","Wolne środki, o których mowa w art. 217 ust.2 pkt 6 ustawy, w tym:","Wolne środki, o których mowa w art. 217 ust.2 pkt 6 ustawy, w tym:","x","","","",{"$f":"+IF(ISNONTEXT(H27),IF(H27<>0,I27/H27-1,\"\"),\"\")","v":-0.11816265823930416},-1,"","","","","","","","",""]
["x","4.2.1","na pokrycie deficytu budżetu","na pokrycie deficytu budżetu","x","","","",{"$f":"+IF(ISNONTEXT(H28),IF(H28<>0,I28/H28-1,\"\"),\"\")","v":1.4766588869858888},-1,"","","","","","","","",""]
["x","4.3","Kredyty, pożyczki, emisja papierów wartościowych, w tym:","Kredyty, pożyczki, emisja papierów wartościowych, w tym:","x",-0.4,6.076308055555546E-2,-2.777777777777779E-2,{"$f":"+IF(ISNONTEXT(H29),IF(H29<>0,I29/H29-1,\"\"),\"\")","v":0.34571428571428564},-1,"","","","","","","","",""]
["x","4.3.1","na pokrycie deficytu budżetu","na pokrycie deficytu budżetu","x","","","",{"$f":"+IF(ISNONTEXT(H30),IF(H30<>0,I30/H30-1,\"\"),\"\")","v":""},"","","","","","","","","",""]
["x","4.4","Inne przychody niezwiązane z zaciągnięciem długu, w tym:","Inne przychody niezwiązane z zaciągnięciem długu, w tym:","x","","","",{"$f":"+IF(ISNONTEXT(H31),IF(H31<>0,I31/H31-1,\"\"),\"\")","v":""},"","","","","","","","","",""]
["x","4.4.1","na pokrycie deficytu budżetu","na pokrycie deficytu budżetu","x","","","",{"$f":"+IF(ISNONTEXT(H32),IF(H32<>0,I32/H32-1,\"\"),\"\")","v":""},"","","","","","","","","",""]
["x",5,"Rozchody budżetu","Rozchody budżetu","x",0.32612845795678114,-0.25085889971443243,-0.2511828324181431,{"$f":"+IF(ISNONTEXT(H33),IF(H33<>0,I33/H33-1,\"\"),\"\")","v":1.4748096169945755},-0.80083648407643315,0.29596378978508153,0.28790516018860046,0.22354531147809031,-0.12397348227801852,-4.0638682782307756E-2,0,0,2.4844658771034034E-2,3.6361123973032816E-2]
["x","5.1","Spłaty rat kapitałowych kredytów i pożyczek oraz wykup papierów wartościowych","Spłaty rat kapitałowych kredytów i pożyczek oraz wykup papierów wartościowych, w tym:","x",0.32612845795678114,-0.25085889971443243,-0.2511828324181431,{"$f":"+IF(ISNONTEXT(H34),IF(H34<>0,I34/H34-1,\"\"),\"\")","v":1.4748096169945755},-0.80083648407643315,0.29596378978508153,0.28790516018860046,0.22354531147809031,-0.12397348227801852,-4.0638682782307756E-2,0,0,2.4844658771034034E-2,3.6361123973032816E-2]
["x","5.1.1","łączna kwota przypadających na dany rok kwot wyłączeń określonych w: art. 243 ust. 3 pkt 1 ustawy (lub art. 169 ust. 3 pkt 1 ufp z 2005 r.), art. 121a ustawy z dnia 27 sierpnia 2009 r. – Przepisy wprowadzające ustawę o finansach publicznych (Dz. U. Nr 157, poz. 1241, z późn. zm.) oraz art. 36 ustawy z dnia 7 grudnia 2012 r. o zmianie niektórych ustaw związanych z realizacją ustawy budżetowej (Dz.U. poz. 1456), w tym:","łączna kwota przypadających na dany rok kwot wyłączeń określonych w: art. 243 ust. 3 pkt 1 ustawy (lub art. 169 ust. 3 pkt 1 ufp z 2005 r.), art. 121a ustawy z dnia 27 sierpnia 2009 r. – Przepisy wprowadzające ustawę o finansach publicznych (Dz. U. Nr 157, poz. 1241, z późn. zm.) oraz art. 36 ustawy z dnia 7 grudnia 2012 r. o zmianie niektórych ustaw związanych z realizacją ustawy budżetowej (Dz.U. poz. 1456), w tym:","x","","","",{"$f":"+IF(ISNONTEXT(H35),IF(H35<>0,I35/H35-1,\"\"),\"\")","v":""},"","","","","","","","","",""]
["x","5.1.1.1","kwota przypadających na dany rok kwot wyłączeń określonych w art. 243 ust. 3 pkt 1 ustawy lub art. 169 ust. 3 pkt 1 ufp z 2005 r.","kwota przypadających na dany rok kwot wyłączeń określonych w art. 243 ust. 3 pkt 1 ustawy lub art. 169 ust. 3 pkt 1 ufp z 2005 r.","x","","","",{"$f":"+IF(ISNONTEXT(H36),IF(H36<>0,I36/H36-1,\"\"),\"\")","v":""},"","","","","","","","","",""]
[null,"5.2","Inne rozchody niezwiązane ze spłatą długu","Inne rozchody niezwiązane ze spłatą długu","x","","","",{"$f":"+IF(ISNONTEXT(H37),IF(H37<>0,I37/H37-1,\"\"),\"\")","v":""},"","","","","","","","","",""]
["x",6,"Kwota długu","Kwota długu","x",8.2379565547934464E-2,0.13768675895243176,0.11482530823260162,{"$f":"+IF(ISNONTEXT(H38),IF(H38<>0,I38/H38-1,\"\"),\"\")","v":0},-6.0506862142400419E-2,-8.3464901669089264E-2,-0.11728397281240155,-0.16256899232174016,-0.17006147005234984,-0.19658130094007142,-0.24468101273979437,-0.32394394536185855,-0.49107203443805425,-1]
[null,"6.1","Łączna kwota wyłączeń z ograniczeń długu określonych w art. 170 ust. 3 ufp z 2005 r. oraz w art. 36 ustawy o zmianie niektórych ustaw związanych z realizacją ustawy budżetowej, w tym: ","Łączna kwota wyłączeń z ograniczeń długu określonych w art. 170 ust. 3 ufp z 2005 r. oraz w art. 36 ustawy o zmianie niektórych ustaw związanych z realizacją ustawy budżetowej, w tym: ","x","","","",{"$f":"+IF(ISNONTEXT(H39),IF(H39<>0,I39/H39-1,\"\"),\"\")","v":""},"","","","","","","","","",""]
[null,"6.1.1","kwota wyłączeń z ograniczeń długu określonych w art. 170 ust. 3 ufp z 2005 r. ","kwota wyłączeń z ograniczeń długu określonych w art. 170 ust. 3 ufp z 2005 r. ","x","","","",{"$f":"+IF(ISNONTEXT(H40),IF(H40<>0,I40/H40-1,\"\"),\"\")","v":""},"","","","","","","","","",""]
[null,"6.2","Wskaźnik z art. 170 ufp z 2005 r., bez uwzględniania wyłączeń","Wskaźnik zadłużenia do dochodów ogółem określony w art. 170 ufp z 2005 r., bez uwzględniania wyłączeń określonych w pkt 6.1.","x",9.7035040431266761E-2,-8.0410989501898955E-3,5.5840964931874737E-3,{"$f":"+IF(ISNONTEXT(H41),IF(H41<>0,I41/H41-1,\"\"),\"\")","v":-7.2856508218569482E-2},0.10781025395304256,-8.347750865051895E-2,-0.1172722982538934,-0.17562149157979146,-0.18287937743190663,-0.20873015873015877,-0.25576730190571706,-0.33423180592991919,-0.49797570850202433,-1]
[null,"6.3","Wskaźnik z art. 170 ufp z 2005 r. po uwzględnieniu wyłączeń","Wskaźnik zadłużenia do dochodów ogółem, o którym mowa w art. 170 ufp z 2005 r., po uwzględnieniu wyłączeń określonych w pkt 6.1. ","x",9.7035040431266761E-2,-8.0410989501898955E-3,5.5840964931874737E-3,{"$f":"+IF(ISNONTEXT(H42),IF(H42<>0,I42/H42-1,\"\"),\"\")","v":-7.2856508218569482E-2},0.10781025395304256,-8.347750865051895E-2,-0.1172722982538934,-0.17562149157979146,-0.18287937743190663,-0.20873015873015877,-0.25576730190571706,-0.33423180592991919,-0.49797570850202433,-1]
[null,7,"Kwota zobowiązań wynikających z przejęcia przez jednostkę samorządu terytorialnego zobowiązań po likwidowanych i przekształcanych jednostkach zaliczanych do sektora finansów publicznych","Kwota zobowiązań wynikających z przejęcia przez jednostkę samorządu terytorialnego zobowiązań po likwidowanych i przekształcanych jednostkach zaliczanych do sektora finansów publicznych","x","","","",{"$f":"+IF(ISNONTEXT(H43),IF(H43<>0,I43/H43-1,\"\"),\"\")","v":""},"","","","","","","","","",""]
[null,8,"Relacja zrównoważenia wydatków bieżących, o której mowa w art. 242 ustawy","Relacja zrównoważenia wydatków bieżących, o której mowa w art. 242 ustawy","x",{"$f":"+IF(ISNONTEXT(E44),IF(E44<>0,F44/E44-1,\"\"),\"\")","v":""},"","",{"$f":"+IF(ISNONTEXT(H44),IF(H44<>0,I44/H44-1,\"\"),\"\")","v":""},"","","","","","","","","",""]
[null,"8.1","Różnica między dochodami bieżącymi a wydatkami bieżącymi","Różnica między dochodami bieżącymi a wydatkami bieżącymi","x",2.3278290917352042,-0.69463360919235062,0.15312406280283897,{"$f":"+IF(ISNONTEXT(H45),IF(H45<>0,I45/H45-1,\"\"),\"\")","v":-0.57196235133483331},3.1004642252394126,-5.865867005790748E-2,-6.2068965517241392E-2,3.1862745098039325E-2,1.4251781472684133E-2,1.4051522248243575E-2,6.9284064665127154E-3,6.8807339449541427E-3,1.1389521640091216E-2,0]
[null,"8.2","Różnica między dochodami bieżącymi, powiększonymi o nadwyżkę budżetową określoną w pkt 4.1. i wolne środki określone w pkt 4.2. a wydatkami bieżącymi, pomniejszonym o wydatki określone w pkt 2.1.2.","Różnica między dochodami bieżącymi, powiększonymi o nadwyżkę budżetową określoną w pkt 4.1. i wolne środki określone w pkt 4.2. a wydatkami bieżącymi, pomniejszonym o wydatki określone w pkt 2.1.2.","x",2.3278290917352042,0.60036692196131769,1.4481245939565071,{"$f":"+IF(ISNONTEXT(H46),IF(H46<>0,I46/H46-1,\"\"),\"\")","v":-0.33191294982691233},0.2374408855882888,-5.865867005790748E-2,-6.2068965517241392E-2,3.1862745098039325E-2,1.4251781472684133E-2,1.4051522248243575E-2,6.9284064665127154E-3,6.8807339449541427E-3,1.1389521640091216E-2,0]
["x",9,"Wskaźnik spłaty zobowiązań","Wskaźnik spłaty zobowiązań","x","x","x","x","x","x","x","x","x","x","x","x","x","x","x"]
[null,"9.1","Wskaźnik z art. 169 ust. 1 ufp z 2005 r. bez uwzględnienia wyłączeń","Wskaźnik planowanej łącznej kwoty spłaty zobowiązań, o której mowa w art. 169 ust. 1 ufp z 2005 r. do dochodów ogółem, bez uwzględnienia wyłączeń określonych w pkt 5.1.1. ","x","x","x","x","x","x","x","x","x","x","x","x","x","x","x"]
[null,"9.2","Wskaźnik z art. 169 ust. 1 ufp z 2005 r. po uwzględnieniu wyłączeń","Wskaźnik planowanej łącznej kwoty spłaty zobowiązań, o której mowa w art. 169 ust. 1 ufp z 2005 r. do dochodów ogółem, po uwzględnieniu wyłączeń przypadających na dany rok określonych w pkt 5.1.1. ","x","x","x","x","x","x","x","x","x","x","x","x","x","x","x"]
["x","9.3","Relacja [R+O]/D , bez uwzględnienia zobowiązań związku JST i bez uwzględniania wyłączeń","Wskaźnik planowanej łącznej kwoty spłaty zobowiązań, o której mowa w art. 243 ust. 1 ustawy do dochodów ogółem, bez uwzględnienia zobowiązań związku współtworzonego przez jednostkę samorządu terytorialnego i bez uwzględniania wyłączeń przypadających na dany rok określonych w pkt 5.1.1.","x","x","x","x","x","x","x","x","x","x","x","x","x","x","x"]
["x","9.4","Wskaźnik planowanej łącznej kwoty spłaty zobowiązań, o której mowa w art. 243 ust. 1 ustawy do dochodów ogółem, bez uwzględnienia zobowiązań związku współtworzonego przez jednostkę samorządu terytorialnego, po uwzględnieniu wyłączeń przypadających na dany rok określonych w pkt 5.1.1. ","Wskaźnik planowanej łącznej kwoty spłaty zobowiązań, o której mowa w art. 243 ust. 1 ustawy do dochodów ogółem, bez uwzględnienia zobowiązań związku współtworzonego przez jednostkę samorządu terytorialnego, po uwzględnieniu wyłączeń przypadających na dany rok określonych w pkt 5.1.1. ","x","x","x","x","x","x","x","x","x","x","x","x","x","x","x"]
["x","9.5","Kwota zobowiązań związku współtworzonego przez jednostkę samorządu terytorialnego przypadających do spłaty w danym roku budżetowym, podlegająca doliczeniu zgodnie z art. 244 ustawy ","Kwota zobowiązań związku współtworzonego przez jednostkę samorządu terytorialnego przypadających do spłaty w danym roku budżetowym, podlegająca doliczeniu zgodnie z art. 244 ustawy ","x",{"$f":"+IF(ISNONTEXT(E52),IF(E52<>0,F52/E52-1,\"\"),\"\")","v":""},{"$f":"+IF(ISNONTEXT(F52),IF(F52<>0,G52/F52-1,\"\"),\"\")","v":""},{"$f":"+IF(ISNONTEXT(F52),IF(F52<>0,H52/F52-1,\"\"),\"\")","v":""},{"$f":"+IF(ISNONTEXT(H52),IF(H52<>0,I52/H52-1,\"\"),\"\")","v":""},"","","","","","","","","",""]
["x","9.6","Relacja [R+O]/D , z uwzględnieniem zobowiązań związku JST i po uwzględnianiu wyłączeń","Wskaźnik planowanej łącznej kwoty spłaty zobowiązań, o której mowa w art. 243 ust. 1 ustawy do dochodów ogółem, po uwzględnieniu zobowiązań związku współtworzonego przez jednostkę samorządu terytorialnego oraz po uwzględnieniu wyłączeń przypadających na dany rok określonych w pkt 5.1.1.","x","x","x","x","x","x","x","x","x","x","x","x","x","x","x"]
["x","9.6.1","Wskaźnik jednoroczny (prawa strona wzoru z art. 243)","Wskaźnik jednoroczny (prawa strona wzoru z art. 243)","x","x","x","x","x","x","x","x","x","x","x","x","x","x","x"]
["x","9.7","Limit spłaty zobowiązań z art. 243 ustawy, po uwzględnieniu wyłączeń obliczony w oparciu o plan 3 kw. roku N-1","Dopuszczalny wskaźnik spłaty zobowiązań określony w art. 243 ustawy, po uwzględnieniu wyłączeń określonych w art. 36 ustawy z dnia 7 grudnia 2012 r. o zmianie niektórych ustaw związanych z realizacją ustawy budżetowej, obliczony w oparciu o plan 3 kwartałów roku poprzedzającego rok budżetowy","x","x","x","x","x","x","x","x","x","x","x","x","x","x","x"]
["x","9.7.1","Limit spłaty zobowiązań z art. 243 ustawy, po uwzględnieniu wyłączeń obliczony w oparciu o wykonanie 4 kw. roku N-1","Dopuszczalny wskaźnik spłaty zobowiązań określony w art. 243 ustawy, po uwzględnieniu wyłączeń określonych w art. 36 ustawy z dnia 7 grudnia 2012 r. o zmianie niektórych ustaw związanych z realizacją ustawy budżetowej, obliczony w oparciu o wykonanie roku poprzedzającego rok budżetowy","x","x","x","x","x","x","x","x","x","x","x","x","x","x","x"]
["x","9.8","Informacja o spełnieniu wskaźnika spłaty zobowiązań określonego w art. 243 ustawy, po uwzględnieniu zobowiązań związku współtworzonego przez jednostkę samorządu terytorialnego oraz po uwzględnieniu wyłączeń określonych w pkt 5.1.1., obliczonego w oparciu o plan 3 kwartałów roku poprzedzającego rok budżetowy","Informacja o spełnieniu wskaźnika spłaty zobowiązań określonego w art. 243 ustawy, po uwzględnieniu zobowiązań związku współtworzonego przez jednostkę samorządu terytorialnego oraz po uwzględnieniu wyłączeń określonych w pkt 5.1.1., obliczonego w oparciu o plan 3 kwartałów roku poprzedzającego rok budżetowy","x","x","x","x","x","x","x","x","x","x","x","x","x","x","x"]
["x","9.8.1","Informacja o spełnieniu wskaźnika spłaty zobowiązań określonego w art. 243 ustawy, po uwzględnieniu zobowiązań związku współtworzonego przez jednostkę samorządu terytorialnego oraz po uwzględnieniu wyłączeń określonych w pkt 5.1.1., obliczonego w oparciu o wykonanie roku poprzedzającego rok budżetowy","Informacja o spełnieniu wskaźnika spłaty zobowiązań określonego w art. 243 ustawy, po uwzględnieniu zobowiązań związku współtworzonego przez jednostkę samorządu terytorialnego oraz po uwzględnieniu wyłączeń określonych w pkt 5.1.1., obliczonego w oparciu o wykonanie roku poprzedzającego rok budżetowy","x","x","x","x","x","x","x","x","x","x","x","x","x","x","x"]
[null,10,"Przeznaczenie prognozowanej nadwyżki budżetowej, w tym na:","Przeznaczenie prognozowanej nadwyżki budżetowej, w tym na:","x",{"$f":"+IF(ISNONTEXT(E59),IF(E59<>0,F59/E59-1,\"\"),\"\")","v":""},"",{"$f":"+IF(ISNONTEXT(F59),IF(F59<>0,H59/F59-1,\"\"),\"\")","v":""},{"$f":"+IF(ISNONTEXT(H59),IF(H59<>0,I59/H59-1,\"\"),\"\")","v":""},"",0.29596378978508153,0.28790516018860046,0.22354531147809031,-0.12397348227801852,-4.0638682782307756E-2,0,0,2.4844658771034034E-2,3.6361123973032816E-2]
[null,"10.1","Spłaty kredytów, pożyczek i wykup papierów wartościowych","Spłaty kredytów, pożyczek i wykup papierów wartościowych","x","","","",{"$f":"+IF(ISNONTEXT(H60),IF(H60<>0,I60/H60-1,\"\"),\"\")","v":""},"",0.29596378978508153,0.28790516018860046,0.22354531147809031,-0.12397348227801852,-4.0638682782307756E-2,0,0,2.4844658771034034E-2,3.6361123973032816E-2]
[null,11,"Informacje uzupełniające o wybranych rodzajach wydatków budżetowych","Informacje uzupełniające o wybranych rodzajach wydatków budżetowych","x","","","",{"$f":"+IF(ISNONTEXT(H61),IF(H61<>0,I61/H61-1,\"\"),\"\")","v":""},"","","","","","","","","",""]
[null,"11.1","Wydatki na wynagrodzenia i składki od nich naliczane","Wydatki bieżące na wynagrodzenia i składki od nich naliczane","x",-1,"","",{"$f":"+IF(ISNONTEXT(H62),IF(H62<>0,I62/H62-1,\"\"),\"\")","v":4.7839286545970472E-2},-1.4404321868841996E-2,3.2258064516129004E-2,1.5625E-2,1.538461538461533E-2,1.5151515151515138E-2,1.4925373134328401E-2,1.4705882352941124E-2,1.449275362318847E-2,1.7928571428571516E-2,1.7472458073117592E-2]
[null,"11.2","Wydatki związane z funkcjonowaniem organów JST","Wydatki związane z funkcjonowaniem organów jednostki samorządu terytorialnego","x","","","",{"$f":"+IF(ISNONTEXT(H63),IF(H63<>0,I63/H63-1,\"\"),\"\")","v":""},-4.7294205187645044E-2,3.3333333333333437E-2,3.2258064516129004E-2,3.125E-2,3.0303030303030276E-2,2.9411764705882248E-2,2.857142857142847E-2,2.7777777777777679E-2,2.7027027027026973E-2,2.6315789473684292E-2]
[null,"11.3","Wydatki objęte limitem art. 226 ust. 3 ustawy, z tego:","Wydatki objęte limitem art. 226 ust. 3 ustawy, z tego:","x","","","",{"$f":"+IF(ISNONTEXT(H64),IF(H64<>0,I64/H64-1,\"\"),\"\")","v":""},0.53906004488032111,-0.92213257690126127,-0.99987552867528151,0,0,0,-0.64285714285714279,-1,"",""]
[null,"11.3.1","Wydatki bieżące objęte limitem art. 226 ust. 3","bieżące","x","","","",{"$f":"+IF(ISNONTEXT(H65),IF(H65<>0,I65/H65-1,\"\"),\"\")","v":""},0.63124619854658048,-0.79143309796357508,-0.99987552867528151,0,0,0,-0.64285714285714279,-1,"",""]
[null,"11.3.2","Wydatki majątkowe objęte limitem art. 226 ust. 3","majątkowe","x","","","",{"$f":"+IF(ISNONTEXT(H66),IF(H66<>0,I66/H66-1,\"\"),\"\")","v":""},0.48892951804036189,-1,"","","","","","","",""]
[null,"11.4","Wydatki inwestycyjne kontynuowane ","Wydatki inwestycyjne kontynuowane ","x","","","",{"$f":"+IF(ISNONTEXT(H67),IF(H67<>0,I67/H67-1,\"\"),\"\")","v":""},-1,"","","","","","","","",""]
[null,"11.5","Nowe wydatki inwestycyjne","Nowe wydatki inwestycyjne","x","","","",{"$f":"+IF(ISNONTEXT(H68),IF(H68<>0,I68/H68-1,\"\"),\"\")","v":""},-1,"","","","","","","","",""]
[null,"11.6","Wydatki majątkowe w formie dotacji ","Wydatki majątkowe w formie dotacji ","x","","","",{"$f":"+IF(ISNONTEXT(H69),IF(H69<>0,I69/H69-1,\"\"),\"\")","v":""},-1,"","","","","","","","",""]
[null,12,"Finansowanie programów, projektów lub zadań realizowanych z udziałem środków, o których mowa w art. 5 ust. 1 pkt 2 i 3 ustawy","Finansowanie programów, projektów lub zadań realizowanych z udziałem środków, o których mowa w art. 5 ust. 1 pkt 2 i 3 ustawy","x","","","",{"$f":"+IF(ISNONTEXT(H70),IF(H70<>0,I70/H70-1,\"\"),\"\")","v":""},"","","","","","","","","",""]
[null,"12.1","Dochody bieżące na programy, projekty lub zadania finansowane z udziałem środków, o których mowa w art. 5 ust. 1 pkt 2 i 3 ustawy, w tym:","Dochody bieżące na programy, projekty lub zadania finansowane z udziałem środków, o których mowa w art. 5 ust. 1 pkt 2 i 3 ustawy, w tym:","x","","","",{"$f":"+IF(ISNONTEXT(H71),IF(H71<>0,I71/H71-1,\"\"),\"\")","v":1.1041335309461373},-0.88641792741213599,-1,"","","","","","","",""]
[null,"12.1.1","środki określone w art. 5 ust. 1 pkt 2 ustawy, w tym:","środki określone w art. 5 ust. 1 pkt 2 ustawy, w tym:","x",-1,"","",{"$f":"+IF(ISNONTEXT(H72),IF(H72<>0,I72/H72-1,\"\"),\"\")","v":0.90691804324929737},-0.87467114892926812,-1,"","","","","","","",""]
[null,"12.1.1.1","środki określone w art. 5 ust. 1 pkt 2 ustawy wynikające wyłącznie z zawartych umów na realizację programu, projektu lub zadania","środki określone w art. 5 ust. 1 pkt 2 ustawy wynikające wyłącznie z zawartych umów na realizację programu, projektu lub zadania","x","","","",{"$f":"+IF(ISNONTEXT(H73),IF(H73<>0,I73/H73-1,\"\"),\"\")","v":""},-0.87467114892926812,-1,"","","","","","","",""]
[null,"12.2","Dochody majątkowe na programy, projekty lub zadania finansowane z udziałem środków, o których mowa w art. 5 ust. 1 pkt 2 i 3 ustawy, w tym:","Dochody majątkowe na programy, projekty lub zadania finansowane z udziałem środków, o których mowa w art. 5 ust. 1 pkt 2 i 3 ustawy, w tym:","x","","","",{"$f":"+IF(ISNONTEXT(H74),IF(H74<>0,I74/H74-1,\"\"),\"\")","v":""},-1,"","","","","","","","",""]
[null,"12.2.1","środki określone w art. 5 ust. 1 pkt 2 ustawy, w tym:","środki określone w art. 5 ust. 1 pkt 2 ustawy, w tym:","x",-1,"","",{"$f":"+IF(ISNONTEXT(H75),IF(H75<>0,I75/H75-1,\"\"),\"\")","v":-1.967927070375397E-2},-1,"","","","","","","","",""]
[null,"12.2.1.1","środki określone w art. 5 ust. 1 pkt 2 ustawy wynikające wyłącznie z zawartych umów na realizację programu, projektu lub zadania","środki określone w art. 5 ust. 1 pkt 2 ustawy wynikające wyłącznie z zawartych umów na realizację programu, projektu lub zadania","x","","","",{"$f":"+IF(ISNONTEXT(H76),IF(H76<>0,I76/H76-1,\"\"),\"\")","v":""},-1,"","","","","","","","",""]
[null,"12.3","Wydatki bieżące na programy, projekty lub zadania finansowane z udziałem środków, o których mowa w art. 5 ust. 1 pkt 2 i 3 ustawy","Wydatki bieżące na programy, projekty lub zadania finansowane z udziałem środków, o których mowa w art. 5 ust. 1 pkt 2 i 3 ustawy","x","","","",{"$f":"+IF(ISNONTEXT(H77),IF(H77<>0,I77/H77-1,\"\"),\"\")","v":""},-0.86726656934288238,-1,"","","","","","","",""]
[null,"12.3.1","w tym finansowane środkami określonymi w art. 5 ust. 1 pkt 2 ustawy ","w tym finansowane środkami określonymi w art. 5 ust. 1 pkt 2 ustawy ","x","","","",{"$f":"+IF(ISNONTEXT(H78),IF(H78<>0,I78/H78-1,\"\"),\"\")","v":0.48944100357109943},-0.8676189822000987,-1,"","","","","","","",""]
[null,"12.3.2","Wydatki bieżące na realizację programu, projektu lub zadania wynikające wyłącznie z zawartych umów z podmiotem dysponującym środkami, o których mowa w art. 5 ust. 1 pkt 2 ustawy ","Wydatki bieżące na realizację programu, projektu lub zadania wynikające wyłącznie z zawartych umów z podmiotem dysponującym środkami, o których mowa w art. 5 ust. 1 pkt 2 ustawy ","x",{"$f":"+IF(ISNONTEXT(E79),IF(E79<>0,F79/E79-1,\"\"),\"\")","v":""},"","",{"$f":"+IF(ISNONTEXT(H79),IF(H79<>0,I79/H79-1,\"\"),\"\")","v":""},-1,"","","","","","","","",""]
[null,"12.4","Wydatki majątkowe na programy, projekty lub zadania finansowane z udziałem środków, o których mowa w art. 5 ust. 1 pkt 2 i 3 ustawy","Wydatki majątkowe na programy, projekty lub zadania finansowane z udziałem środków, o których mowa w art. 5 ust. 1 pkt 2 i 3 ustawy","x","","","",{"$f":"+IF(ISNONTEXT(H80),IF(H80<>0,I80/H80-1,\"\"),\"\")","v":""},-1,"","","","","","","","",""]
[null,"12.4.1","w tym finansowane środkami określonymi w art. 5 ust. 1 pkt 2 ustawy","w tym finansowane środkami określonymi w art. 5 ust. 1 pkt 2 ustawy","x","","","",{"$f":"+IF(ISNONTEXT(H81),IF(H81<>0,I81/H81-1,\"\"),\"\")","v":-0.84226429837272077},-1,"","","","","","","","",""]
[null,"12.4.2","Wydatki majątkowe na realizację programu, projektu lub zadania wynikające wyłącznie z zawartych umów z podmiotem dysponującym środkami, o których mowa w art. 5 ust. 1 pkt 2 ustawy ","Wydatki majątkowe na realizację programu, projektu lub zadania wynikające wyłącznie z zawartych umów z podmiotem dysponującym środkami, o których mowa w art. 5 ust. 1 pkt 2 ustawy ","x","","","",{"$f":"+IF(ISNONTEXT(H82),IF(H82<>0,I82/H82-1,\"\"),\"\")","v":""},-1,"","","","","","","","",""]
[null,13,"Kwoty dotyczące przejęcia i spłaty zobowiązań po samodzielnych publicznych zakładach opieki zdrowotnej oraz pokrycia ujemnego wyniku ","Kwoty dotyczące przejęcia i spłaty zobowiązań po samodzielnych publicznych zakładach opieki zdrowotnej oraz pokrycia ujemnego wyniku ","x","","","",{"$f":"+IF(ISNONTEXT(H83),IF(H83<>0,I83/H83-1,\"\"),\"\")","v":""},"","","","","","","","","",""]
[null,"13.1","Kwota zobowiązań wynikających z przejęcia przez jednostkę samorządu terytorialnego zobowiązań po likwidowanych i przekształcanych samodzielnych zakładach opieki zdrowotnej","Kwota zobowiązań wynikających z przejęcia przez jednostkę samorządu terytorialnego zobowiązań po likwidowanych i przekształcanych samodzielnych zakładach opieki zdrowotnej","x","","","",{"$f":"+IF(ISNONTEXT(H84),IF(H84<>0,I84/H84-1,\"\"),\"\")","v":""},"","","","","","","","","",""]
[null,"13.2","Dochody budżetowe z tytułu dotacji celowej z budżetu państwa, o której mowa w art. 196 ustawy z dnia 15 kwietnia 2011 r. o działalności leczniczej (Dz.U. Nr 112, poz. 654, z późn. zm.)","Dochody budżetowe z tytułu dotacji celowej z budżetu państwa, o której mowa w art. 196 ustawy z dnia 15 kwietnia 2011 r. o działalności leczniczej (Dz.U. Nr 112, poz. 654, z późn. zm.)","x","","","",{"$f":"+IF(ISNONTEXT(H85),IF(H85<>0,I85/H85-1,\"\"),\"\")","v":""},"","","","","","","","","",""]
[null,"13.3","Wysokość zobowiązań podlegających umorzeniu, o którym mowa w art. 190 ustawy o działalności leczniczej","Wysokość zobowiązań podlegających umorzeniu, o którym mowa w art. 190 ustawy o działalności leczniczej","x","","","",{"$f":"+IF(ISNONTEXT(H86),IF(H86<>0,I86/H86-1,\"\"),\"\")","v":""},"","","","","","","","","",""]
[null,"13.4","Wydatki na spłatę przejętych zobowiązań samodzielnego publicznego zakładu opieki zdrowotnej przekształconego na zasadach określonych w przepisach o działalności leczniczej","Wydatki na spłatę przejętych zobowiązań samodzielnego publicznego zakładu opieki zdrowotnej przekształconego na zasadach określonych w przepisach o działalności leczniczej","x","","","",{"$f":"+IF(ISNONTEXT(H87),IF(H87<>0,I87/H87-1,\"\"),\"\")","v":""},"","","","","","","","","",""]
[null,"13.5","Wydatki na spłatę przejętych zobowiązań samodzielnego publicznego zakładu opieki zdrowotnej likwidowanego na zasadach określonych w przepisach o działalności leczniczej","Wydatki na spłatę przejętych zobowiązań samodzielnego publicznego zakładu opieki zdrowotnej likwidowanego na zasadach określonych w przepisach o działalności leczniczej","x","","","",{"$f":"+IF(ISNONTEXT(H88),IF(H88<>0,I88/H88-1,\"\"),\"\")","v":""},"","","","","","","","","",""]
[null,"13.6","Wydatki na spłatę zobowiązań samodzielnego publicznego zakładu opieki zdrowotnej przejętych do końca 2011 r. na podstawie przepisów o zakładach opieki zdrowotnej","Wydatki na spłatę zobowiązań samodzielnego publicznego zakładu opieki zdrowotnej przejętych do końca 2011 r. na podstawie przepisów o zakładach opieki zdrowotnej","x","","","",{"$f":"+IF(ISNONTEXT(H89),IF(H89<>0,I89/H89-1,\"\"),\"\")","v":""},"","","","","","","","","",""]
[null,"13.7","Wydatki bieżące na pokrycie ujemnego wyniku finansowego samodzielnego publicznego zakładu opieki zdrowotnej","Wydatki bieżące na pokrycie ujemnego wyniku finansowego samodzielnego publicznego zakładu opieki zdrowotnej","x","","","",{"$f":"+IF(ISNONTEXT(H90),IF(H90<>0,I90/H90-1,\"\"),\"\")","v":""},"","","","","","","","","",""]
["x",14,"Dane uzupełniające o długu i jego spłacie","Dane uzupełniające o długu i jego spłacie","x","","","",{"$f":"+IF(ISNONTEXT(H91),IF(H91<>0,I91/H91-1,\"\"),\"\")","v":""},"","","","","","","","","",""]
["x","14.1","Spłaty rat kapitałowych oraz wykup papierów wartościowych, o których mowa w pkt. 5.1., wynikające wyłącznie z tytułu zobowiązań już zaciągniętych","Spłaty rat kapitałowych oraz wykup papierów wartościowych, o których mowa w pkt. 5.1., wynikające wyłącznie z tytułu zobowiązań już zaciągniętych","x","","","",{"$f":"+IF(ISNONTEXT(H92),IF(H92<>0,I92/H92-1,\"\"),\"\")","v":""},-0.80083648407643315,0.29596378978508153,0.28790516018860046,0.22354531147809031,-0.22837396252022757,-0.11378673038362774,0,-0.45801386865994298,-0.50703939696114386,-1]
["x","14.2","Kwota długu, którego planowana spłata dokona się z wydatków budżetu","Kwota długu, którego planowana spłata dokona się z wydatków budżetu","x","","","",{"$f":"+IF(ISNONTEXT(H93),IF(H93<>0,I93/H93-1,\"\"),\"\")","v":""},"","","","","","","","","",""]
["x","14.3","Wydatki zmniejszające dług, w tym:","Wydatki zmniejszające dług, w tym:","x","","","",{"$f":"+IF(ISNONTEXT(H94),IF(H94<>0,I94/H94-1,\"\"),\"\")","v":""},"","","","","","","","","",""]
["x","14.3.1","spłata zobowiązań wymagalnych z lat poprzednich, innych niż w pkt 14.3.3","spłata zobowiązań wymagalnych z lat poprzednich, innych niż w pkt 14.3.3","x","","","",{"$f":"+IF(ISNONTEXT(H95),IF(H95<>0,I95/H95-1,\"\"),\"\")","v":""},"","","","","","","","","",""]
["x","14.3.2","związane z umowami zaliczanymi do tytułów dłużnych wliczanych w państwowy dług publiczny","związane z umowami zaliczanymi do tytułów dłużnych wliczanych w państwowy dług publiczny","x","","","",{"$f":"+IF(ISNONTEXT(H96),IF(H96<>0,I96/H96-1,\"\"),\"\")","v":""},"","","","","","","","","",""]
["x","14.3.3","wypłaty z tytułu wymagalnych poręczeń i gwarancji","wypłaty z tytułu wymagalnych poręczeń i gwarancji","x","","","",{"$f":"+IF(ISNONTEXT(H97),IF(H97<>0,I97/H97-1,\"\"),\"\")","v":""},"","","","","","","","","",""]
["x","14.4","Wynik operacji niekasowych wpływających na kwotę długu (m.in. umorzenia, różnice kursowe)","Wynik operacji niekasowych wpływających na kwotę długu (m.in. umorzenia, różnice kursowe)","x","","","",{"$f":"+IF(ISNONTEXT(H98),IF(H98<>0,I98/H98-1,\"\"),\"\")","v":""},"","","","","","","","","",""]

{"sheet":"definicja","index":1,"n_rows":104,"n_cols":34,"rows_kept":104,"cut":false,"hidden":true,"merged":[]}
[]
[]
[]
[]
[]
[]
[]
[]
[null,"Lp.","Wyszczególnienie",0,0,{"$f":"+E9+1","v":1},{"$f":"+F9+1","v":2},3,4,5,6,7,8,9,10,{"$f":"+O9+1","v":11},12,13,14,15,16,17,18,19,20,21,22,23,24,25,26,27,{"$f":"+AF9+1","v":28},{"$f":"+AG9+1","v":29}]
[10,1,"Dochody ogółem",{"$f":"+\"rokwzgl=\"&D$9&\" i lp=\"&$A10","v":"rokwzgl=0 i lp=10"},"rokwzgl=0 i lp=10","rokwzgl=1 i lp=10","rokwzgl=2 i lp=10","rokwzgl=3 i lp=10","rokwzgl=4 i lp=10","rokwzgl=5 i lp=10","rokwzgl=6 i lp=10","rokwzgl=7 i lp=10","rokwzgl=8 i lp=10",{"$f":"+\"rokwzgl=\"&N$9&\" i lp=\"&$A10","v":"rokwzgl=9 i lp=10"},"rokwzgl=10 i lp=10","rokwzgl=11 i lp=10","rokwzgl=12 i lp=10","rokwzgl=13 i lp=10","rokwzgl=14 i lp=10","rokwzgl=15 i lp=10","rokwzgl=16 i lp=10","rokwzgl=17 i lp=10","rokwzgl=18 i lp=10",{"$f":"+\"rokwzgl=\"&X$9&\" i lp=\"&$A10","v":"rokwzgl=19 i lp=10"},"rokwzgl=20 i lp=10","rokwzgl=21 i lp=10","rokwzgl=22 i lp=10","rokwzgl=23 i lp=10","rokwzgl=24 i lp=10","rokwzgl=25 i lp=10","rokwzgl=26 i lp=10","rokwzgl=27 i lp=10","rokwzgl=28 i lp=10","rokwzgl=29 i lp=10"]
[20,1.1000000000000001," Dochody bieżące","rokwzgl=0 i lp=20","rokwzgl=0 i lp=20","rokwzgl=1 i lp=20","rokwzgl=2 i lp=20","rokwzgl=3 i lp=20","rokwzgl=4 i lp=20","rokwzgl=5 i lp=20","rokwzgl=6 i lp=20","rokwzgl=7 i lp=20","rokwzgl=8 i lp=20","rokwzgl=9 i lp=20","rokwzgl=10 i lp=20","rokwzgl=11 i lp=20","rokwzgl=12 i lp=20","rokwzgl=13 i lp=20","rokwzgl=14 i lp=20","rokwzgl=15 i lp=20","rokwzgl=16 i lp=20","rokwzgl=17 i lp=20","rokwzgl=18 i lp=20","rokwzgl=19 i lp=20","rokwzgl=20 i lp=20","rokwzgl=21 i lp=20","rokwzgl=22 i lp=20","rokwzgl=23 i lp=20","rokwzgl=24 i lp=20","rokwzgl=25 i lp=20","rokwzgl=26 i lp=20","rokwzgl=27 i lp=20","rokwzgl=28 i lp=20","rokwzgl=29 i lp=20"]
[30,"1.1.1","  dochody z tytułu udziału we wpływach z podatku dochodowego od osób fizycznych","rokwzgl=0 i lp=30","rokwzgl=0 i lp=30","rokwzgl=1 i lp=30","rokwzgl=2 i lp=30","rokwzgl=3 i lp=30","rokwzgl=4 i lp=30","rokwzgl=5 i lp=30","rokwzgl=6 i lp=30","rokwzgl=7 i lp=30","rokwzgl=8 i lp=30","rokwzgl=9 i lp=30","rokwzgl=10 i lp=30","rokwzgl=11 i lp=30","rokwzgl=12 i lp=30","rokwzgl=13 i lp=30","rokwzgl=14 i lp=30","rokwzgl=15 i lp=30","rokwzgl=16 i lp=30","rokwzgl=17 i lp=30","rokwzgl=18 i lp=30","rokwzgl=19 i lp=30","rokwzgl=20 i lp=30","rokwzgl=21 i lp=30","rokwzgl=22 i lp=30","rokwzgl=23 i lp=30","rokwzgl=24 i lp=30","rokwzgl=25 i lp=30","rokwzgl=26 i lp=30","rokwzgl=27 i lp=30","rokwzgl=28 i lp=30","rokwzgl=29 i lp=30"]
[40,"1.1.2","  dochody z tytułu udziału we wpływach z podatku dochodowego od osób prawnych","rokwzgl=0 i lp=40","rokwzgl=0 i lp=40","rokwzgl=1 i lp=40","rokwzgl=2 i lp=40","rokwzgl=3 i lp=40","rokwzgl=4 i lp=40","rokwzgl=5 i lp=40","rokwzgl=6 i lp=40","rokwzgl=7 i lp=40","rokwzgl=8 i lp=40","rokwzgl=9 i lp=40","rokwzgl=10 i lp=40","rokwzgl=11 i lp=40","rokwzgl=12 i lp=40","rokwzgl=13 i lp=40","rokwzgl=14 i lp=40","rokwzgl=15 i lp=40","rokwzgl=16 i lp=40","rokwzgl=17 i lp=40","rokwzgl=18 i lp=40","rokwzgl=19 i lp=40","rokwzgl=20 i lp=40","rokwzgl=21 i lp=40","rokwzgl=22 i lp=40","rokwzgl=23 i lp=40","rokwzgl=24 i lp=40","rokwzgl=25 i lp=40","rokwzgl=26 i lp=40","rokwzgl=27 i lp=40","rokwzgl=28 i lp=40","rokwzgl=29 i lp=40"]
[50,"1.1.3","  podatki i opłaty","rokwzgl=0 i lp=50","rokwzgl=0 i lp=50","rokwzgl=1 i lp=50","rokwzgl=2 i lp=50","rokwzgl=3 i lp=50","rokwzgl=4 i lp=50","rokwzgl=5 i lp=50","rokwzgl=6 i lp=50","rokwzgl=7 i lp=50","rokwzgl=8 i lp=50","rokwzgl=9 i lp=50","rokwzgl=10 i lp=50","rokwzgl=11 i lp=50","rokwzgl=12 i lp=50","rokwzgl=13 i lp=50","rokwzgl=14 i lp=50","rokwzgl=15 i lp=50","rokwzgl=16 i lp=50","rokwzgl=17 i lp=50","rokwzgl=18 i lp=50","rokwzgl=19 i lp=50","rokwzgl=20 i lp=50","rokwzgl=21 i lp=50","rokwzgl=22 i lp=50","rokwzgl=23 i lp=50","rokwzgl=24 i lp=50","rokwzgl=25 i lp=50","rokwzgl=26 i lp=50","rokwzgl=27 i lp=50","rokwzgl=28 i lp=50","rokwzgl=29 i lp=50"]
[60,"1.1.3.1","   z podatku od nieruchomości","rokwzgl=0 i lp=60","rokwzgl=0 i lp=60","rokwzgl=1 i lp=60","rokwzgl=2 i lp=60","rokwzgl=3 i lp=60","rokwzgl=4 i lp=60","rokwzgl=5 i lp=60","rokwzgl=6 i lp=60","rokwzgl=7 i lp=60","rokwzgl=8 i lp=60","rokwzgl=9 i lp=60","rokwzgl=10 i lp=60","rokwzgl=11 i lp=60","rokwzgl=12 i lp=60","rokwzgl=13 i lp=60","rokwzgl=14 i lp=60","rokwzgl=15 i lp=60","rokwzgl=16 i lp=60","rokwzgl=17 i lp=60","rokwzgl=18 i lp=60","rokwzgl=19 i lp=60","rokwzgl=20 i lp=60","rokwzgl=21 i lp=60","rokwzgl=22 i lp=60","rokwzgl=23 i lp=60","rokwzgl=24 i lp=60","rokwzgl=25 i lp=60","rokwzgl=26 i lp=60","rokwzgl=27 i lp=60","rokwzgl=28 i lp=60","rokwzgl=29 i lp=60"]
[70,"1.1.4","  z subwencji ogólnej","rokwzgl=0 i lp=70","rokwzgl=0 i lp=70","rokwzgl=1 i lp=70","rokwzgl=2 i lp=70","rokwzgl=3 i lp=70","rokwzgl=4 i lp=70","rokwzgl=5 i lp=70","rokwzgl=6 i lp=70","rokwzgl=7 i lp=70","rokwzgl=8 i lp=70","rokwzgl=9 i lp=70","rokwzgl=10 i lp=70","rokwzgl=11 i lp=70","rokwzgl=12 i lp=70","rokwzgl=13 i lp=70","rokwzgl=14 i lp=70","rokwzgl=15 i lp=70","rokwzgl=16 i lp=70","rokwzgl=17 i lp=70","rokwzgl=18 i lp=70","rokwzgl=19 i lp=70","rokwzgl=20 i lp=70","rokwzgl=21 i lp=70","rokwzgl=22 i lp=70","rokwzgl=23 i lp=70","rokwzgl=24 i lp=70","rokwzgl=25 i lp=70","rokwzgl=26 i lp=70","rokwzgl=27 i lp=70","rokwzgl=28 i lp=70","rokwzgl=29 i lp=70"]
[80,"1.1.5","  z tytułu dotacji i środków przeznaczonych na cele bieżące","rokwzgl=0 i lp=80","rokwzgl=0 i lp=80","rokwzgl=1 i lp=80","rokwzgl=2 i lp=80","rokwzgl=3 i lp=80","rokwzgl=4 i lp=80","rokwzgl=5 i lp=80","rokwzgl=6 i lp=80","rokwzgl=7 i lp=80","rokwzgl=8 i lp=80","rokwzgl=9 i lp=80","rokwzgl=10 i lp=80","rokwzgl=11 i lp=80","rokwzgl=12 i lp=80","rokwzgl=13 i lp=80","rokwzgl=14 i lp=80","rokwzgl=15 i lp=80","rokwzgl=16 i lp=80","rokwzgl=17 i lp=80","rokwzgl=18 i lp=80","rokwzgl=19 i lp=80","rokwzgl=20 i lp=80","rokwzgl=21 i lp=80","rokwzgl=22 i lp=80","rokwzgl=23 i lp=80","rokwzgl=24 i lp=80","rokwzgl=25 i lp=80","rokwzgl=26 i lp=80","rokwzgl=27 i lp=80","rokwzgl=28 i lp=80","rokwzgl=29 i lp=80"]
[90,1.2,"  Dochody majątkowe, w tym","rokwzgl=0 i lp=90","rokwzgl=0 i lp=90","rokwzgl=1 i lp=90","rokwzgl=2 i lp=90","rokwzgl=3 i lp=90","rokwzgl=4 i lp=90","rokwzgl=5 i lp=90","rokwzgl=6 i lp=90","rokwzgl=7 i lp=90","rokwzgl=8 i lp=90","rokwzgl=9 i lp=90","rokwzgl=10 i lp=90","rokwzgl=11 i lp=90","rokwzgl=12 i lp=90","rokwzgl=13 i lp=90","rokwzgl=14 i lp=90","rokwzgl=15 i lp=90","rokwzgl=16 i lp=90","rokwzgl=17 i lp=90","rokwzgl=18 i lp=90","rokwzgl=19 i lp=90","rokwzgl=20 i lp=90","rokwzgl=21 i lp=90","rokwzgl=22 i lp=90","rokwzgl=23 i lp=90","rokwzgl=24 i lp=90","rokwzgl=25 i lp=90","rokwzgl=26 i lp=90","rokwzgl=27 i lp=90","rokwzgl=28 i lp=90","rokwzgl=29 i lp=90"]
[100,"1.2.1","  ze sprzedaży majątku","rokwzgl=0 i lp=100","rokwzgl=0 i lp=100","rokwzgl=1 i lp=100","rokwzgl=2 i lp=100","rokwzgl=3 i lp=100","rokwzgl=4 i lp=100","rokwzgl=5 i lp=100","rokwzgl=6 i lp=100","rokwzgl=7 i lp=100","rokwzgl=8 i lp=100","rokwzgl=9 i lp=100","rokwzgl=10 i lp=100","rokwzgl=11 i lp=100","rokwzgl=12 i lp=100","rokwzgl=13 i lp=100","rokwzgl=14 i lp=100","rokwzgl=15 i lp=100","rokwzgl=16 i lp=100","rokwzgl=17 i lp=100","rokwzgl=18 i lp=100","rokwzgl=19 i lp=100","rokwzgl=20 i lp=100","rokwzgl=21 i lp=100","rokwzgl=22 i lp=100","rokwzgl=23 i lp=100","rokwzgl=24 i lp=100","rokwzgl=25 i lp=100","rokwzgl=26 i lp=100","rokwzgl=27 i lp=100","rokwzgl=28 i lp=100","rokwzgl=29 i lp=100"]
[110,"1.2.2","  z tytułu dotacji oraz środków przeznaczonych na inwestycje",{"$f":"+\"rokwzgl=\"&D$9&\" i lp=\"&$A20","v":"rokwzgl=0 i lp=110"},"rokwzgl=0 i lp=110","rokwzgl=1 i lp=110","rokwzgl=2 i lp=110","rokwzgl=3 i lp=110","rokwzgl=4 i lp=110","rokwzgl=5 i lp=110","rokwzgl=6 i lp=110","rokwzgl=7 i lp=110","rokwzgl=8 i lp=110",{"$f":"+\"rokwzgl=\"&N$9&\" i lp=\"&$A20","v":"rokwzgl=9 i lp=110"},"rokwzgl=10 i lp=110","rokwzgl=11 i lp=110","rokwzgl=12 i lp=110","rokwzgl=13 i lp=110","rokwzgl=14 i lp=110","rokwzgl=15 i lp=110","rokwzgl=16 i lp=110","rokwzgl=17 i lp=110","rokwzgl=18 i lp=110",{"$f":"+\"rokwzgl=\"&X$9&\" i lp=\"&$A20","v":"rokwzgl=19 i lp=110"},"rokwzgl=20 i lp=110","rokwzgl=21 i lp=110","rokwzgl=22 i lp=110","rokwzgl=23 i lp=110","rokwzgl=24 i lp=110","rokwzgl=25 i lp=110","rokwzgl=26 i lp=110","rokwzgl=27 i lp=110","rokwzgl=28 i lp=110","rokwzgl=29 i lp=110"]
[120,2,"Wydatki ogółem","rokwzgl=0 i lp=120","rokwzgl=0 i lp=120","rokwzgl=1 i lp=120","rokwzgl=2 i lp=120","rokwzgl=3 i lp=120","rokwzgl=4 i lp=120","rokwzgl=5 i lp=120","rokwzgl=6 i lp=120","rokwzgl=7 i lp=120","rokwzgl=8 i lp=120","rokwzgl=9 i lp=120","rokwzgl=10 i lp=120","rokwzgl=11 i lp=120","rokwzgl=12 i lp=120","rokwzgl=13 i lp=120","rokwzgl=14 i lp=120","rokwzgl=15 i lp=120","rokwzgl=16 i lp=120","rokwzgl=17 i lp=120","rokwzgl=18 i lp=120","rokwzgl=19 i lp=120","rokwzgl=20 i lp=120","rokwzgl=21 i lp=120","rokwzgl=22 i lp=120","rokwzgl=23 i lp=120","rokwzgl=24 i lp=120","rokwzgl=25 i lp=120","rokwzgl=26 i lp=120","rokwzgl=27 i lp=120","rokwzgl=28 i lp=120","rokwzgl=29 i lp=120"]
[130,2.1," Wydatki bieżące, w tym:","rokwzgl=0 i lp=130","rokwzgl=0 i lp=130","rokwzgl=1 i lp=130","rokwzgl=2 i lp=130","rokwzgl=3 i lp=130","rokwzgl=4 i lp=130","rokwzgl=5 i lp=130","rokwzgl=6 i lp=130","rokwzgl=7 i lp=130","rokwzgl=8 i lp=130","rokwzgl=9 i lp=130","rokwzgl=10 i lp=130","rokwzgl=11 i lp=130","rokwzgl=12 i lp=130","rokwzgl=13 i lp=130","rokwzgl=14 i lp=130","rokwzgl=15 i lp=130","rokwzgl=16 i lp=130","rokwzgl=17 i lp=130","rokwzgl=18 i lp=130","rokwzgl=19 i lp=130","rokwzgl=20 i lp=130","rokwzgl=21 i lp=130","rokwzgl=22 i lp=130","rokwzgl=23 i lp=130","rokwzgl=24 i lp=130","rokwzgl=25 i lp=130","rokwzgl=26 i lp=130","rokwzgl=27 i lp=130","rokwzgl=28 i lp=130","rokwzgl=29 i lp=130"]
[140,"2.1.1","  z tytułu poręczeń i gwarancji","rokwzgl=0 i lp=140","rokwzgl=0 i lp=140","rokwzgl=1 i lp=140","rokwzgl=2 i lp=140","rokwzgl=3 i lp=140","rokwzgl=4 i lp=140","rokwzgl=5 i lp=140","rokwzgl=6 i lp=140","rokwzgl=7 i lp=140","rokwzgl=8 i lp=140","rokwzgl=9 i lp=140","rokwzgl=10 i lp=140","rokwzgl=11 i lp=140","rokwzgl=12 i lp=140","rokwzgl=13 i lp=140","rokwzgl=14 i lp=140","rokwzgl=15 i lp=140","rokwzgl=16 i lp=140","rokwzgl=17 i lp=140","rokwzgl=18 i lp=140","rokwzgl=19 i lp=140","rokwzgl=20 i lp=140","rokwzgl=21 i lp=140","rokwzgl=22 i lp=140","rokwzgl=23 i lp=140","rokwzgl=24 i lp=140","rokwzgl=25 i lp=140","rokwzgl=26 i lp=140","rokwzgl=27 i lp=140","rokwzgl=28 i lp=140","rokwzgl=29 i lp=140"]
[150,"2.1.1.1","   w tym: gwarancje i poręczenia podlegające wyłączeniu z limitów spłaty zobowiązań  określonych w art. 243 ust. 3 pkt 2 ustawy z dnia 27 sierpnia 2009 r. o finansach publicznych (Dz. U. Nr 157, poz. 1240, z późn. zm.) lub art. 169 ust. 3 pkt 2 ustawy z dnia 30 czerwca 2005 r. o finansach publicznych (Dz. U. Nr 249, poz. 2104, z późn. zm)","rokwzgl=0 i lp=150","rokwzgl=0 i lp=150","rokwzgl=1 i lp=150","rokwzgl=2 i lp=150","rokwzgl=3 i lp=150","rokwzgl=4 i lp=150","rokwzgl=5 i lp=150","rokwzgl=6 i lp=150","rokwzgl=7 i lp=150","rokwzgl=8 i lp=150","rokwzgl=9 i lp=150","rokwzgl=10 i lp=150","rokwzgl=11 i lp=150","rokwzgl=12 i lp=150","rokwzgl=13 i lp=150","rokwzgl=14 i lp=150","rokwzgl=15 i lp=150","rokwzgl=16 i lp=150","rokwzgl=17 i lp=150","rokwzgl=18 i lp=150","rokwzgl=19 i lp=150","rokwzgl=20 i lp=150","rokwzgl=21 i lp=150","rokwzgl=22 i lp=150","rokwzgl=23 i lp=150","rokwzgl=24 i lp=150","rokwzgl=25 i lp=150","rokwzgl=26 i lp=150","rokwzgl=27 i lp=150","rokwzgl=28 i lp=150","rokwzgl=29 i lp=150"]
[160,"2.1.2","   na spłatę przejętych zobowiązań samodzielnego publicznego zakładu opieki zdrowotnej przekształconego na zasadach określonych w przepisach  o działalności leczniczej, w wysokości w jakiej nie podlegają sfinansowaniu dotacją z budżetu państwa)","rokwzgl=0 i lp=160","rokwzgl=0 i lp=160","rokwzgl=1 i lp=160","rokwzgl=2 i lp=160","rokwzgl=3 i lp=160","rokwzgl=4 i lp=160","rokwzgl=5 i lp=160","rokwzgl=6 i lp=160","rokwzgl=7 i lp=160","rokwzgl=8 i lp=160","rokwzgl=9 i lp=160","rokwzgl=10 i lp=160","rokwzgl=11 i lp=160","rokwzgl=12 i lp=160","rokwzgl=13 i lp=160","rokwzgl=14 i lp=160","rokwzgl=15 i lp=160","rokwzgl=16 i lp=160","rokwzgl=17 i lp=160","rokwzgl=18 i lp=160","rokwzgl=19 i lp=160","rokwzgl=20 i lp=160","rokwzgl=21 i lp=160","rokwzgl=22 i lp=160","rokwzgl=23 i lp=160","rokwzgl=24 i lp=160","rokwzgl=25 i lp=160","rokwzgl=26 i lp=160","rokwzgl=27 i lp=160","rokwzgl=28 i lp=160","rokwzgl=29 i lp=160"]
[170,"2.1.3","  wydatki na obsługę długu","rokwzgl=0 i lp=170","rokwzgl=0 i lp=170","rokwzgl=1 i lp=170","rokwzgl=2 i lp=170","rokwzgl=3 i lp=170","rokwzgl=4 i lp=170","rokwzgl=5 i lp=170","rokwzgl=6 i lp=170","rokwzgl=7 i lp=170","rokwzgl=8 i lp=170","rokwzgl=9 i lp=170","rokwzgl=10 i lp=170","rokwzgl=11 i lp=170","rokwzgl=12 i lp=170","rokwzgl=13 i lp=170","rokwzgl=14 i lp=170","rokwzgl=15 i lp=170","rokwzgl=16 i lp=170","rokwzgl=17 i lp=170","rokwzgl=18 i lp=170","rokwzgl=19 i lp=170","rokwzgl=20 i lp=170","rokwzgl=21 i lp=170","rokwzgl=22 i lp=170","rokwzgl=23 i lp=170","rokwzgl=24 i lp=170","rokwzgl=25 i lp=170","rokwzgl=26 i lp=170","rokwzgl=27 i lp=170","rokwzgl=28 i lp=170","rokwzgl=29 i lp=170"]
[180,"2.1.3.1","   w tym odsetki i dyskonto określone w art. 243 ust. 1 ustawy lub art. 169 ust. 1 ufp z 2005 r..","rokwzgl=0 i lp=180","rokwzgl=0 i lp=180","rokwzgl=1 i lp=180","rokwzgl=2 i lp=180","rokwzgl=3 i lp=180","rokwzgl=4 i lp=180","rokwzgl=5 i lp=180","rokwzgl=6 i lp=180","rokwzgl=7 i lp=180","rokwzgl=8 i lp=180","rokwzgl=9 i lp=180","rokwzgl=10 i lp=180","rokwzgl=11 i lp=180","rokwzgl=12 i lp=180","rokwzgl=13 i lp=180","rokwzgl=14 i lp=180","rokwzgl=15 i lp=180","rokwzgl=16 i lp=180","rokwzgl=17 i lp=180","rokwzgl=18 i lp=180","rokwzgl=19 i lp=180","rokwzgl=20 i lp=180","rokwzgl=21 i lp=180","rokwzgl=22 i lp=180","rokwzgl=23 i lp=180","rokwzgl=24 i lp=180","rokwzgl=25 i lp=180","rokwzgl=26 i lp=180","rokwzgl=27 i lp=180","rokwzgl=28 i lp=180","rokwzgl=29 i lp=180"]
[190,2.2000000000000002," Wydatki majątkowe","rokwzgl=0 i lp=190","rokwzgl=0 i lp=190","rokwzgl=1 i lp=190","rokwzgl=2 i lp=190","rokwzgl=3 i lp=190","rokwzgl=4 i lp=190","rokwzgl=5 i lp=190","rokwzgl=6 i lp=190","rokwzgl=7 i lp=190","rokwzgl=8 i lp=190","rokwzgl=9 i lp=190","rokwzgl=10 i lp=190","rokwzgl=11 i lp=190","rokwzgl=12 i lp=190","rokwzgl=13 i lp=190","rokwzgl=14 i lp=190","rokwzgl=15 i lp=190","rokwzgl=16 i lp=190","rokwzgl=17 i lp=190","rokwzgl=18 i lp=190","rokwzgl=19 i lp=190","rokwzgl=20 i lp=190","rokwzgl=21 i lp=190","rokwzgl=22 i lp=190","rokwzgl=23 i lp=190","rokwzgl=24 i lp=190","rokwzgl=25 i lp=190","rokwzgl=26 i lp=190","rokwzgl=27 i lp=190","rokwzgl=28 i lp=190","rokwzgl=29 i lp=190"]
[200,3,"Wynik budżetu","rokwzgl=0 i lp=200","rokwzgl=0 i lp=200","rokwzgl=1 i lp=200","rokwzgl=2 i lp=200","rokwzgl=3 i lp=200","rokwzgl=4 i lp=200","rokwzgl=5 i lp=200","rokwzgl=6 i lp=200","rokwzgl=7 i lp=200","rokwzgl=8 i lp=200","rokwzgl=9 i lp=200","rokwzgl=10 i lp=200","rokwzgl=11 i lp=200","rokwzgl=12 i lp=200","rokwzgl=13 i lp=200","rokwzgl=14 i lp=200","rokwzgl=15 i lp=200","rokwzgl=16 i lp=200","rokwzgl=17 i lp=200","rokwzgl=18 i lp=200","rokwzgl=19 i lp=200","rokwzgl=20 i lp=200","rokwzgl=21 i lp=200","rokwzgl=22 i lp=200","rokwzgl=23 i lp=200","rokwzgl=24 i lp=200","rokwzgl=25 i lp=200","rokwzgl=26 i lp=200","rokwzgl=27 i lp=200","rokwzgl=28 i lp=200","rokwzgl=29 i lp=200"]
[210,4,"Przychody budżetu",{"$f":"+\"rokwzgl=\"&D$9&\" i lp=\"&$A30","v":"rokwzgl=0 i lp=210"},"rokwzgl=0 i lp=210","rokwzgl=1 i lp=210","rokwzgl=2 i lp=210","rokwzgl=3 i lp=210","rokwzgl=4 i lp=210","rokwzgl=5 i lp=210","rokwzgl=6 i lp=210","rokwzgl=7 i lp=210","rokwzgl=8 i lp=210",{"$f":"+\"rokwzgl=\"&N$9&\" i lp=\"&$A30","v":"rokwzgl=9 i lp=210"},"rokwzgl=10 i lp=210","rokwzgl=11 i lp=210","rokwzgl=12 i lp=210","rokwzgl=13 i lp=210","rokwzgl=14 i lp=210","rokwzgl=15 i lp=210","rokwzgl=16 i lp=210","rokwzgl=17 i lp=210","rokwzgl=18 i lp=210",{"$f":"+\"rokwzgl=\"&X$9&\" i lp=\"&$A30","v":"rokwzgl=19 i lp=210"},"rokwzgl=20 i lp=210","rokwzgl=21 i lp=210","rokwzgl=22 i lp=210","rokwzgl=23 i lp=210","rokwzgl=24 i lp=210","rokwzgl=25 i lp=210","rokwzgl=26 i lp=210","rokwzgl=27 i lp=210","rokwzgl=28 i lp=210","rokwzgl=29 i lp=210"]
[220,4.0999999999999996," Nadwyżka budżetowa z lat ubiegłych","rokwzgl=0 i lp=220","rokwzgl=0 i lp=220","rokwzgl=1 i lp=220","rokwzgl=2 i lp=220","rokwzgl=3 i lp=220","rokwzgl=4 i lp=220","rokwzgl=5 i lp=220","rokwzgl=6 i lp=220","rokwzgl=7 i lp=220","rokwzgl=8 i lp=220","rokwzgl=9 i lp=220","rokwzgl=10 i lp=220","rokwzgl=11 i lp=220","rokwzgl=12 i lp=220","rokwzgl=13 i lp=220","rokwzgl=14 i lp=220","rokwzgl=15 i lp=220","rokwzgl=16 i lp=220","rokwzgl=17 i lp=220","rokwzgl=18 i lp=220","rokwzgl=19 i lp=220","rokwzgl=20 i lp=220","rokwzgl=21 i lp=220","rokwzgl=22 i lp=220","rokwzgl=23 i lp=220","rokwzgl=24 i lp=220","rokwzgl=25 i lp=220","rokwzgl=26 i lp=220","rokwzgl=27 i lp=220","rokwzgl=28 i lp=220","rokwzgl=29 i lp=220"]
[230,"4.1.1","  w tym na pokrycie deficytu budżetu","rokwzgl=0 i lp=230","rokwzgl=0 i lp=230","rokwzgl=1 i lp=230","rokwzgl=2 i lp=230","rokwzgl=3 i lp=230","rokwzgl=4 i lp=230","rokwzgl=5 i lp=230","rokwzgl=6 i lp=230","rokwzgl=7 i lp=230","rokwzgl=8 i lp=230","rokwzgl=9 i lp=230","rokwzgl=10 i lp=230","rokwzgl=11 i lp=230","rokwzgl=12 i lp=230","rokwzgl=13 i lp=230","rokwzgl=14 i lp=230","rokwzgl=15 i lp=230","rokwzgl=16 i lp=230","rokwzgl=17 i lp=230","rokwzgl=18 i lp=230","rokwzgl=19 i lp=230","rokwzgl=20 i lp=230","rokwzgl=21 i lp=230","rokwzgl=22 i lp=230","rokwzgl=23 i lp=230","rokwzgl=24 i lp=230","rokwzgl=25 i lp=230","rokwzgl=26 i lp=230","rokwzgl=27 i lp=230","rokwzgl=28 i lp=230","rokwzgl=29 i lp=230"]
[240,4.2," Wolne środki, o których mowa w art. 217 ust.2 pkt 6 ustawy","rokwzgl=0 i lp=240","rokwzgl=0 i lp=240","rokwzgl=1 i lp=240","rokwzgl=2 i lp=240","rokwzgl=3 i lp=240","rokwzgl=4 i lp=240","rokwzgl=5 i lp=240","rokwzgl=6 i lp=240","rokwzgl=7 i lp=240","rokwzgl=8 i lp=240","rokwzgl=9 i lp=240","rokwzgl=10 i lp=240","rokwzgl=11 i lp=240","rokwzgl=12 i lp=240","rokwzgl=13 i lp=240","rokwzgl=14 i lp=240","rokwzgl=15 i lp=240","rokwzgl=16 i lp=240","rokwzgl=17 i lp=240","rokwzgl=18 i lp=240","rokwzgl=19 i lp=240","rokwzgl=20 i lp=240","rokwzgl=21 i lp=240","rokwzgl=22 i lp=240","rokwzgl=23 i lp=240","rokwzgl=24 i lp=240","rokwzgl=25 i lp=240","rokwzgl=26 i lp=240","rokwzgl=27 i lp=240","rokwzgl=28 i lp=240","rokwzgl=29 i lp=240"]
[250,"4.2.1","   w tym na pokrycie deficytu budżetu","rokwzgl=0 i lp=250","rokwzgl=0 i lp=250","rokwzgl=1 i lp=250","rokwzgl=2 i lp=250","rokwzgl=3 i lp=250","rokwzgl=4 i lp=250","rokwzgl=5 i lp=250","rokwzgl=6 i lp=250","rokwzgl=7 i lp=250","rokwzgl=8 i lp=250","rokwzgl=9 i lp=250","rokwzgl=10 i lp=250","rokwzgl=11 i lp=250","rokwzgl=12 i lp=250","rokwzgl=13 i lp=250","rokwzgl=14 i lp=250","rokwzgl=15 i lp=250","rokwzgl=16 i lp=250","rokwzgl=17 i lp=250","rokwzgl=18 i lp=250","rokwzgl=19 i lp=250","rokwzgl=20 i lp=250","rokwzgl=21 i lp=250","rokwzgl=22 i lp=250","rokwzgl=23 i lp=250","rokwzgl=24 i lp=250","rokwzgl=25 i lp=250","rokwzgl=26 i lp=250","rokwzgl=27 i lp=250","rokwzgl=28 i lp=250","rokwzgl=29 i lp=250"]
[260,4.3,"  Kredyty, pożyczki, emisja papierów wartościowych","rokwzgl=0 i lp=260","rokwzgl=0 i lp=260","rokwzgl=1 i lp=260","rokwzgl=2 i lp=260","rokwzgl=3 i lp=260","rokwzgl=4 i lp=260","rokwzgl=5 i lp=260","rokwzgl=6 i lp=260","rokwzgl=7 i lp=260","rokwzgl=8 i lp=260","rokwzgl=9 i lp=260","rokwzgl=10 i lp=260","rokwzgl=11 i lp=260","rokwzgl=12 i lp=260","rokwzgl=13 i lp=260","rokwzgl=14 i lp=260","rokwzgl=15 i lp=260","rokwzgl=16 i lp=260","rokwzgl=17 i lp=260","rokwzgl=18 i lp=260","rokwzgl=19 i lp=260","rokwzgl=20 i lp=260","rokwzgl=21 i lp=260","rokwzgl=22 i lp=260","rokwzgl=23 i lp=260","rokwzgl=24 i lp=260","rokwzgl=25 i lp=260","rokwzgl=26 i lp=260","rokwzgl=27 i lp=260","rokwzgl=28 i lp=260","rokwzgl=29 i lp=260"]
[270,"4.3.1","   w tym na pokrycie deficytu budżetu","rokwzgl=0 i lp=270","rokwzgl=0 i lp=270","rokwzgl=1 i lp=270","rokwzgl=2 i lp=270","rokwzgl=3 i lp=270","rokwzgl=4 i lp=270","rokwzgl=5 i lp=270","rokwzgl=6 i lp=270","rokwzgl=7 i lp=270","rokwzgl=8 i lp=270","rokwzgl=9 i lp=270","rokwzgl=10 i lp=270","rokwzgl=11 i lp=270","rokwzgl=12 i lp=270","rokwzgl=13 i lp=270","rokwzgl=14 i lp=270","rokwzgl=15 i lp=270","rokwzgl=16 i lp=270","rokwzgl=17 i lp=270","rokwzgl=18 i lp=270","rokwzgl=19 i lp=270","rokwzgl=20 i lp=270","rokwzgl=21 i lp=270","rokwzgl=22 i lp=270","rokwzgl=23 i lp=270","rokwzgl=24 i lp=270","rokwzgl=25 i lp=270","rokwzgl=26 i lp=270","rokwzgl=27 i lp=270","rokwzgl=28 i lp=270","rokwzgl=29 i lp=270"]
[280,4.4000000000000004," Inne przychody niezwiązane z zaciągnięciem długu","rokwzgl=0 i lp=280","rokwzgl=0 i lp=280","rokwzgl=1 i lp=280","rokwzgl=2 i lp=280","rokwzgl=3 i lp=280","rokwzgl=4 i lp=280","rokwzgl=5 i lp=280","rokwzgl=6 i lp=280","rokwzgl=7 i lp=280","rokwzgl=8 i lp=280","rokwzgl=9 i lp=280","rokwzgl=10 i lp=280","rokwzgl=11 i lp=280","rokwzgl=12 i lp=280","rokwzgl=13 i lp=280","rokwzgl=14 i lp=280","rokwzgl=15 i lp=280","rokwzgl=16 i lp=280","rokwzgl=17 i lp=280","rokwzgl=18 i lp=280","rokwzgl=19 i lp=280","rokwzgl=20 i lp=280","rokwzgl=21 i lp=280","rokwzgl=22 i lp=280","rokwzgl=23 i lp=280","rokwzgl=24 i lp=280","rokwzgl=25 i lp=280","rokwzgl=26 i lp=280","rokwzgl=27 i lp=280","rokwzgl=28 i lp=280","rokwzgl=29 i lp=280"]
[290,"4.4.1","   w tym na pokrycie deficytu budżetu","rokwzgl=0 i lp=290","rokwzgl=0 i lp=290","rokwzgl=1 i lp=290","rokwzgl=2 i lp=290","rokwzgl=3 i lp=290","rokwzgl=4 i lp=290","rokwzgl=5 i lp=290","rokwzgl=6 i lp=290","rokwzgl=7 i lp=290","rokwzgl=8 i lp=290","rokwzgl=9 i lp=290","rokwzgl=10 i lp=290","rokwzgl=11 i lp=290","rokwzgl=12 i lp=290","rokwzgl=13 i lp=290","rokwzgl=14 i lp=290","rokwzgl=15 i lp=290","rokwzgl=16 i lp=290","rokwzgl=17 i lp=290","rokwzgl=18 i lp=290","rokwzgl=19 i lp=290","rokwzgl=20 i lp=290","rokwzgl=21 i lp=290","rokwzgl=22 i lp=290","rokwzgl=23 i lp=290","rokwzgl=24 i lp=290","rokwzgl=25 i lp=290","rokwzgl=26 i lp=290","rokwzgl=27 i lp=290","rokwzgl=28 i lp=290","rokwzgl=29 i lp=290"]
[300,5,"Rozchody budżetu","rokwzgl=0 i lp=300","rokwzgl=0 i lp=300","rokwzgl=1 i lp=300","rokwzgl=2 i lp=300","rokwzgl=3 i lp=300","rokwzgl=4 i lp=300","rokwzgl=5 i lp=300","rokwzgl=6 i lp=300","rokwzgl=7 i lp=300","rokwzgl=8 i lp=300","rokwzgl=9 i lp=300","rokwzgl=10 i lp=300","rokwzgl=11 i lp=300","rokwzgl=12 i lp=300","rokwzgl=13 i lp=300","rokwzgl=14 i lp=300","rokwzgl=15 i lp=300","rokwzgl=16 i lp=300","rokwzgl=17 i lp=300","rokwzgl=18 i lp=300","rokwzgl=19 i lp=300","rokwzgl=20 i lp=300","rokwzgl=21 i lp=300","rokwzgl=22 i lp=300","rokwzgl=23 i lp=300","rokwzgl=24 i lp=300","rokwzgl=25 i lp=300","rokwzgl=26 i lp=300","rokwzgl=27 i lp=300","rokwzgl=28 i lp=300","rokwzgl=29 i lp=300"]
[310,5.0999999999999996," Spłaty rat kapitałowych kredytów i pożyczek oraz wykup papierów wartościowych",{"$f":"+\"rokwzgl=\"&D$9&\" i lp=\"&$A40","v":"rokwzgl=0 i lp=310"},"rokwzgl=0 i lp=310","rokwzgl=1 i lp=310","rokwzgl=2 i lp=310","rokwzgl=3 i lp=310","rokwzgl=4 i lp=310","rokwzgl=5 i lp=310","rokwzgl=6 i lp=310","rokwzgl=7 i lp=310","rokwzgl=8 i lp=310",{"$f":"+\"rokwzgl=\"&N$9&\" i lp=\"&$A40","v":"rokwzgl=9 i lp=310"},"rokwzgl=10 i lp=310","rokwzgl=11 i lp=310","rokwzgl=12 i lp=310","rokwzgl=13 i lp=310","rokwzgl=14 i lp=310","rokwzgl=15 i lp=310","rokwzgl=16 i lp=310","rokwzgl=17 i lp=310","rokwzgl=18 i lp=310",{"$f":"+\"rokwzgl=\"&X$9&\" i lp=\"&$A40","v":"rokwzgl=19 i lp=310"},"rokwzgl=20 i lp=310","rokwzgl=21 i lp=310","rokwzgl=22 i lp=310","rokwzgl=23 i lp=310","rokwzgl=24 i lp=310","rokwzgl=25 i lp=310","rokwzgl=26 i lp=310","rokwzgl=27 i lp=310","rokwzgl=28 i lp=310","rokwzgl=29 i lp=310"]
[320,"5.1.1","  w tym łączna kwota przypadających na dany rok kwot wyłączeń określonych w: art. 243 ust. 3 pkt 1 ustawy (lub art. 169 ust. 3 pkt 1 ufp z 2005 r.), art. 121a ustawy  z dnia 27 sierpnia 2009 r. – Przepisy wprowadzające ustawę o finansach publicznych  (Dz. U. Nr 157, poz. 1241, z późn. zm.) oraz art.  36 ustawy z dnia 7 grudnia 2012 r. o zmianie niektórych ustaw związanych z realizacją ustawy budżetowej (Dz.U. poz. 1456)","rokwzgl=0 i lp=320","rokwzgl=0 i lp=320","rokwzgl=1 i lp=320","rokwzgl=2 i lp=320","rokwzgl=3 i lp=320","rokwzgl=4 i lp=320","rokwzgl=5 i lp=320","rokwzgl=6 i lp=320","rokwzgl=7 i lp=320","rokwzgl=8 i lp=320","rokwzgl=9 i lp=320","rokwzgl=10 i lp=320","rokwzgl=11 i lp=320","rokwzgl=12 i lp=320","rokwzgl=13 i lp=320","rokwzgl=14 i lp=320","rokwzgl=15 i lp=320","rokwzgl=16 i lp=320","rokwzgl=17 i lp=320","rokwzgl=18 i lp=320","rokwzgl=19 i lp=320","rokwzgl=20 i lp=320","rokwzgl=21 i lp=320","rokwzgl=22 i lp=320","rokwzgl=23 i lp=320","rokwzgl=24 i lp=320","rokwzgl=25 i lp=320","rokwzgl=26 i lp=320","rokwzgl=27 i lp=320","rokwzgl=28 i lp=320","rokwzgl=29 i lp=320"]
[330,"5.1.1.1","   w tym kwota przypadających na dany rok kwot wyłączeń określonych w art. 243 ust. 3 pkt 1 ustawy lub art. 169 ust. 3 pkt 1 ufp z 2005 r.","rokwzgl=0 i lp=330","rokwzgl=0 i lp=330","rokwzgl=1 i lp=330","rokwzgl=2 i lp=330","rokwzgl=3 i lp=330","rokwzgl=4 i lp=330","rokwzgl=5 i lp=330","rokwzgl=6 i lp=330","rokwzgl=7 i lp=330","rokwzgl=8 i lp=330","rokwzgl=9 i lp=330","rokwzgl=10 i lp=330","rokwzgl=11 i lp=330","rokwzgl=12 i lp=330","rokwzgl=13 i lp=330","rokwzgl=14 i lp=330","rokwzgl=15 i lp=330","rokwzgl=16 i lp=330","rokwzgl=17 i lp=330","rokwzgl=18 i lp=330","rokwzgl=19 i lp=330","rokwzgl=20 i lp=330","rokwzgl=21 i lp=330","rokwzgl=22 i lp=330","rokwzgl=23 i lp=330","rokwzgl=24 i lp=330","rokwzgl=25 i lp=330","rokwzgl=26 i lp=330","rokwzgl=27 i lp=330","rokwzgl=28 i lp=330","rokwzgl=29 i lp=330"]
[340,5.2," Inne rozchody niezwiązane ze spłatą długu","rokwzgl=0 i lp=340","rokwzgl=0 i lp=340","rokwzgl=1 i lp=340","rokwzgl=2 i lp=340","rokwzgl=3 i lp=340","rokwzgl=4 i lp=340","rokwzgl=5 i lp=340","rokwzgl=6 i lp=340","rokwzgl=7 i lp=340","rokwzgl=8 i lp=340","rokwzgl=9 i lp=340","rokwzgl=10 i lp=340","rokwzgl=11 i lp=340","rokwzgl=12 i lp=340","rokwzgl=13 i lp=340","rokwzgl=14 i lp=340","rokwzgl=15 i lp=340","rokwzgl=16 i lp=340","rokwzgl=17 i lp=340","rokwzgl=18 i lp=340","rokwzgl=19 i lp=340","rokwzgl=20 i lp=340","rokwzgl=21 i lp=340","rokwzgl=22 i lp=340","rokwzgl=23 i lp=340","rokwzgl=24 i lp=340","rokwzgl=25 i lp=340","rokwzgl=26 i lp=340","rokwzgl=27 i lp=340","rokwzgl=28 i lp=340","rokwzgl=29 i lp=340"]
[350,6,"Kwota długu","rokwzgl=0 i lp=350","rokwzgl=0 i lp=350","rokwzgl=1 i lp=350","rokwzgl=2 i lp=350","rokwzgl=3 i lp=350","rokwzgl=4 i lp=350","rokwzgl=5 i lp=350","rokwzgl=6 i lp=350","rokwzgl=7 i lp=350","rokwzgl=8 i lp=350","rokwzgl=9 i lp=350","rokwzgl=10 i lp=350","rokwzgl=11 i lp=350","rokwzgl=12 i lp=350","rokwzgl=13 i lp=350","rokwzgl=14 i lp=350","rokwzgl=15 i lp=350","rokwzgl=16 i lp=350","rokwzgl=17 i lp=350","rokwzgl=18 i lp=350","rokwzgl=19 i lp=350","rokwzgl=20 i lp=350","rokwzgl=21 i lp=350","rokwzgl=22 i lp=350","rokwzgl=23 i lp=350","rokwzgl=24 i lp=350","rokwzgl=25 i lp=350","rokwzgl=26 i lp=350","rokwzgl=27 i lp=350","rokwzgl=28 i lp=350","rokwzgl=29 i lp=350"]
[360,6.1," Łączna kwota wyłączeń z ograniczeń długu określonych w art. 170 ust. 3 ufp z 2005 r. oraz w art.  36 ustawy o zmianie niektórych ustaw związanych z realizacją ustawy budżetowej, w tym: ","rokwzgl=0 i lp=360","rokwzgl=0 i lp=360","rokwzgl=1 i lp=360","rokwzgl=2 i lp=360","rokwzgl=3 i lp=360","rokwzgl=4 i lp=360","rokwzgl=5 i lp=360","rokwzgl=6 i lp=360","rokwzgl=7 i lp=360","rokwzgl=8 i lp=360","rokwzgl=9 i lp=360","rokwzgl=10 i lp=360","rokwzgl=11 i lp=360","rokwzgl=12 i lp=360","rokwzgl=13 i lp=360","rokwzgl=14 i lp=360","rokwzgl=15 i lp=360","rokwzgl=16 i lp=360","rokwzgl=17 i lp=360","rokwzgl=18 i lp=360","rokwzgl=19 i lp=360","rokwzgl=20 i lp=360","rokwzgl=21 i lp=360","rokwzgl=22 i lp=360","rokwzgl=23 i lp=360","rokwzgl=24 i lp=360","rokwzgl=25 i lp=360","rokwzgl=26 i lp=360","rokwzgl=27 i lp=360","rokwzgl=28 i lp=360","rokwzgl=29 i lp=360"]
[370,"6.1.1","   - kwota wyłączeń z ograniczeń długu określonych w art. 170 ust. 3 ufp z 2005 r. ","rokwzgl=0 i lp=370","rokwzgl=0 i lp=370","rokwzgl=1 i lp=370","rokwzgl=2 i lp=370","rokwzgl=3 i lp=370","rokwzgl=4 i lp=370","rokwzgl=5 i lp=370","rokwzgl=6 i lp=370","rokwzgl=7 i lp=370","rokwzgl=8 i lp=370","rokwzgl=9 i lp=370","rokwzgl=10 i lp=370","rokwzgl=11 i lp=370","rokwzgl=12 i lp=370","rokwzgl=13 i lp=370","rokwzgl=14 i lp=370","rokwzgl=15 i lp=370","rokwzgl=16 i lp=370","rokwzgl=17 i lp=370","rokwzgl=18 i lp=370","rokwzgl=19 i lp=370","rokwzgl=20 i lp=370","rokwzgl=21 i lp=370","rokwzgl=22 i lp=370","rokwzgl=23 i lp=370","rokwzgl=24 i lp=370","rokwzgl=25 i lp=370","rokwzgl=26 i lp=370","rokwzgl=27 i lp=370","rokwzgl=28 i lp=370","rokwzgl=29 i lp=370"]
[380,6.2," Wskaźnik zadłużenia do dochodów ogółem określony w art. 170 ufp z 2005 r., bez uwzględniania wyłączeń określonych w pkt 6.1.   ","rokwzgl=0 i lp=380","rokwzgl=0 i lp=380","rokwzgl=1 i lp=380","rokwzgl=2 i lp=380","rokwzgl=3 i lp=380","rokwzgl=4 i lp=380","rokwzgl=5 i lp=380","rokwzgl=6 i lp=380","rokwzgl=7 i lp=380","rokwzgl=8 i lp=380","rokwzgl=9 i lp=380","rokwzgl=10 i lp=380","rokwzgl=11 i lp=380","rokwzgl=12 i lp=380","rokwzgl=13 i lp=380","rokwzgl=14 i lp=380","rokwzgl=15 i lp=380","rokwzgl=16 i lp=380","rokwzgl=17 i lp=380","rokwzgl=18 i lp=380","rokwzgl=19 i lp=380","rokwzgl=20 i lp=380","rokwzgl=21 i lp=380","rokwzgl=22 i lp=380","rokwzgl=23 i lp=380","rokwzgl=24 i lp=380","rokwzgl=25 i lp=380","rokwzgl=26 i lp=380","rokwzgl=27 i lp=380","rokwzgl=28 i lp=380","rokwzgl=29 i lp=380"]
[390,6.3," Wskaźnik zadłużenia do dochodów ogółem, o którym mowa w art.  170 ufp z 2005 r., po uwzględnieniu wyłączeń określonych w pkt 6.1. ","rokwzgl=0 i lp=390","rokwzgl=0 i lp=390","rokwzgl=1 i lp=390","rokwzgl=2 i lp=390","rokwzgl=3 i lp=390","rokwzgl=4 i lp=390","rokwzgl=5 i lp=390","rokwzgl=6 i lp=390","rokwzgl=7 i lp=390","rokwzgl=8 i lp=390","rokwzgl=9 i lp=390","rokwzgl=10 i lp=390","rokwzgl=11 i lp=390","rokwzgl=12 i lp=390","rokwzgl=13 i lp=390","rokwzgl=14 i lp=390","rokwzgl=15 i lp=390","rokwzgl=16 i lp=390","rokwzgl=17 i lp=390","rokwzgl=18 i lp=390","rokwzgl=19 i lp=390","rokwzgl=20 i lp=390","rokwzgl=21 i lp=390","rokwzgl=22 i lp=390","rokwzgl=23 i lp=390","rokwzgl=24 i lp=390","rokwzgl=25 i lp=390","rokwzgl=26 i lp=390","rokwzgl=27 i lp=390","rokwzgl=28 i lp=390","rokwzgl=29 i lp=390"]
[400,7,"Kwota zobowiązań wynikających z przejęcia przez jednostkę samorządu terytorialnego zobowiązań po likwidowanych i przekształcanych jednostkach zaliczanych do sektora  finansów publicznych","rokwzgl=0 i lp=400","rokwzgl=0 i lp=400","rokwzgl=1 i lp=400","rokwzgl=2 i lp=400","rokwzgl=3 i lp=400","rokwzgl=4 i lp=400","rokwzgl=5 i lp=400","rokwzgl=6 i lp=400","rokwzgl=7 i lp=400","rokwzgl=8 i lp=400","rokwzgl=9 i lp=400","rokwzgl=10 i lp=400","rokwzgl=11 i lp=400","rokwzgl=12 i lp=400","rokwzgl=13 i lp=400","rokwzgl=14 i lp=400","rokwzgl=15 i lp=400","rokwzgl=16 i lp=400","rokwzgl=17 i lp=400","rokwzgl=18 i lp=400","rokwzgl=19 i lp=400","rokwzgl=20 i lp=400","rokwzgl=21 i lp=400","rokwzgl=22 i lp=400","rokwzgl=23 i lp=400","rokwzgl=24 i lp=400","rokwzgl=25 i lp=400","rokwzgl=26 i lp=400","rokwzgl=27 i lp=400","rokwzgl=28 i lp=400","rokwzgl=29 i lp=400"]
[410,null,null,{"$f":"+\"rokwzgl=\"&D$9&\" i lp=\"&$A50","v":"rokwzgl=0 i lp=410"},"rokwzgl=0 i lp=410","rokwzgl=1 i lp=410","rokwzgl=2 i lp=410","rokwzgl=3 i lp=410","rokwzgl=4 i lp=410","rokwzgl=5 i lp=410","rokwzgl=6 i lp=410","rokwzgl=7 i lp=410","rokwzgl=8 i lp=410",{"$f":"+\"rokwzgl=\"&N$9&\" i lp=\"&$A50","v":"rokwzgl=9 i lp=410"},"rokwzgl=10 i lp=410","rokwzgl=11 i lp=410","rokwzgl=12 i lp=410","rokwzgl=13 i lp=410","rokwzgl=14 i lp=410","rokwzgl=15 i lp=410","rokwzgl=16 i lp=410","rokwzgl=17 i lp=410","rokwzgl=18 i lp=410",{"$f":"+\"rokwzgl=\"&X$9&\" i lp=\"&$A50","v":"rokwzgl=19 i lp=410"},"rokwzgl=20 i lp=410","rokwzgl=21 i lp=410","rokwzgl=22 i lp=410","rokwzgl=23 i lp=410","rokwzgl=24 i lp=410","rokwzgl=25 i lp=410","rokwzgl=26 i lp=410","rokwzgl=27 i lp=410","rokwzgl=28 i lp=410","rokwzgl=29 i lp=410"]
[420,8.1," Różnica między dochodami bieżącymi a  wydatkami bieżącymi","rokwzgl=0 i lp=420","rokwzgl=0 i lp=420","rokwzgl=1 i lp=420","rokwzgl=2 i lp=420","rokwzgl=3 i lp=420","rokwzgl=4 i lp=420","rokwzgl=5 i lp=420","rokwzgl=6 i lp=420","rokwzgl=7 i lp=420","rokwzgl=8 i lp=420","rokwzgl=9 i lp=420","rokwzgl=10 i lp=420","rokwzgl=11 i lp=420","rokwzgl=12 i lp=420","rokwzgl=13 i lp=420","rokwzgl=14 i lp=420","rokwzgl=15 i lp=420","rokwzgl=16 i lp=420","rokwzgl=17 i lp=420","rokwzgl=18 i lp=420","rokwzgl=19 i lp=420","rokwzgl=20 i lp=420","rokwzgl=21 i lp=420","rokwzgl=22 i lp=420","rokwzgl=23 i lp=420","rokwzgl=24 i lp=420","rokwzgl=25 i lp=420","rokwzgl=26 i lp=420","rokwzgl=27 i lp=420","rokwzgl=28 i lp=420","rokwzgl=29 i lp=420"]
[430,8.1999999999999993," Różnica między dochodami bieżącymi, powiększonymi o nadwyżkę budżetową określoną w pkt 4.1. i wolne środki określone w pkt 4.2.  a wydatkami bieżącymi, pomniejszonym o wydatki określone w pkt  2.1.2.","rokwzgl=0 i lp=430","rokwzgl=0 i lp=430","rokwzgl=1 i lp=430","rokwzgl=2 i lp=430","rokwzgl=3 i lp=430","rokwzgl=4 i lp=430","rokwzgl=5 i lp=430","rokwzgl=6 i lp=430","rokwzgl=7 i lp=430","rokwzgl=8 i lp=430","rokwzgl=9 i lp=430","rokwzgl=10 i lp=430","rokwzgl=11 i lp=430","rokwzgl=12 i lp=430","rokwzgl=13 i lp=430","rokwzgl=14 i lp=430","rokwzgl=15 i lp=430","rokwzgl=16 i lp=430","rokwzgl=17 i lp=430","rokwzgl=18 i lp=430","rokwzgl=19 i lp=430","rokwzgl=20 i lp=430","rokwzgl=21 i lp=430","rokwzgl=22 i lp=430","rokwzgl=23 i lp=430","rokwzgl=24 i lp=430","rokwzgl=25 i lp=430","rokwzgl=26 i lp=430","rokwzgl=27 i lp=430","rokwzgl=28 i lp=430","rokwzgl=29 i lp=430"]
[440,null,null,"rokwzgl=0 i lp=440","rokwzgl=0 i lp=440","rokwzgl=1 i lp=440","rokwzgl=2 i lp=440","rokwzgl=3 i lp=440","rokwzgl=4 i lp=440","rokwzgl=5 i lp=440","rokwzgl=6 i lp=440","rokwzgl=7 i lp=440","rokwzgl=8 i lp=440","rokwzgl=9 i lp=440","rokwzgl=10 i lp=440","rokwzgl=11 i lp=440","rokwzgl=12 i lp=440","rokwzgl=13 i lp=440","rokwzgl=14 i lp=440","rokwzgl=15 i lp=440","rokwzgl=16 i lp=440","rokwzgl=17 i lp=440","rokwzgl=18 i lp=440","rokwzgl=19 i lp=440","rokwzgl=20 i lp=440","rokwzgl=21 i lp=440","rokwzgl=22 i lp=440","rokwzgl=23 i lp=440","rokwzgl=24 i lp=440","rokwzgl=25 i lp=440","rokwzgl=26 i lp=440","rokwzgl=27 i lp=440","rokwzgl=28 i lp=440","rokwzgl=29 i lp=440"]
[450,9.1," Wskaźnik planowanej łącznej kwoty spłaty zobowiązań, o której mowa w art. 169 ust. 1 ufp z 2005 r. do dochodów ogółem, bez uwzględnienia wyłączeń określonych w pkt 5.1.1.  ","rokwzgl=0 i lp=450","rokwzgl=0 i lp=450","rokwzgl=1 i lp=450","rokwzgl=2 i lp=450","rokwzgl=3 i lp=450","rokwzgl=4 i lp=450","rokwzgl=5 i lp=450","rokwzgl=6 i lp=450","rokwzgl=7 i lp=450","rokwzgl=8 i lp=450","rokwzgl=9 i lp=450","rokwzgl=10 i lp=450","rokwzgl=11 i lp=450","rokwzgl=12 i lp=450","rokwzgl=13 i lp=450","rokwzgl=14 i lp=450","rokwzgl=15 i lp=450","rokwzgl=16 i lp=450","rokwzgl=17 i lp=450","rokwzgl=18 i lp=450","rokwzgl=19 i lp=450","rokwzgl=20 i lp=450","rokwzgl=21 i lp=450","rokwzgl=22 i lp=450","rokwzgl=23 i lp=450","rokwzgl=24 i lp=450","rokwzgl=25 i lp=450","rokwzgl=26 i lp=450","rokwzgl=27 i lp=450","rokwzgl=28 i lp=450","rokwzgl=29 i lp=450"]
[460,9.1999999999999993," Wskaźnik planowanej łącznej kwoty spłaty zobowiązań, o której mowa w art. 169 ust. 1 ufp z 2005 r. do dochodów ogółem, po uwzględnieniu wyłączeń przypadających na dany rok określonych w pkt 5.1.1. ","rokwzgl=0 i lp=460","rokwzgl=0 i lp=460","rokwzgl=1 i lp=460","rokwzgl=2 i lp=460","rokwzgl=3 i lp=460","rokwzgl=4 i lp=460","rokwzgl=5 i lp=460","rokwzgl=6 i lp=460","rokwzgl=7 i lp=460","rokwzgl=8 i lp=460","rokwzgl=9 i lp=460","rokwzgl=10 i lp=460","rokwzgl=11 i lp=460","rokwzgl=12 i lp=460","rokwzgl=13 i lp=460","rokwzgl=14 i lp=460","rokwzgl=15 i lp=460","rokwzgl=16 i lp=460","rokwzgl=17 i lp=460","rokwzgl=18 i lp=460","rokwzgl=19 i lp=460","rokwzgl=20 i lp=460","rokwzgl=21 i lp=460","rokwzgl=22 i lp=460","rokwzgl=23 i lp=460","rokwzgl=24 i lp=460","rokwzgl=25 i lp=460","rokwzgl=26 i lp=460","rokwzgl=27 i lp=460","rokwzgl=28 i lp=460","rokwzgl=29 i lp=460"]
[470,9.3000000000000007,"Wskaźnik planowanej łącznej kwoty spłaty zobowiązań, o której mowa w art. 243 ust. 1 ustawy do dochodów ogółem, bez uwzględnienia zobowiązań związku współtworzonego przez jednostkę samorządu terytorialnego i bez uwzględniania wyłączeń przypadających na dany rok określonych w pkt 5.1.1.","rokwzgl=0 i lp=470","rokwzgl=0 i lp=470","rokwzgl=1 i lp=470","rokwzgl=2 i lp=470","rokwzgl=3 i lp=470","rokwzgl=4 i lp=470","rokwzgl=5 i lp=470","rokwzgl=6 i lp=470","rokwzgl=7 i lp=470","rokwzgl=8 i lp=470","rokwzgl=9 i lp=470","rokwzgl=10 i lp=470","rokwzgl=11 i lp=470","rokwzgl=12 i lp=470","rokwzgl=13 i lp=470","rokwzgl=14 i lp=470","rokwzgl=15 i lp=470","rokwzgl=16 i lp=470","rokwzgl=17 i lp=470","rokwzgl=18 i lp=470","rokwzgl=19 i lp=470","rokwzgl=20 i lp=470","rokwzgl=21 i lp=470","rokwzgl=22 i lp=470","rokwzgl=23 i lp=470","rokwzgl=24 i lp=470","rokwzgl=25 i lp=470","rokwzgl=26 i lp=470","rokwzgl=27 i lp=470","rokwzgl=28 i lp=470","rokwzgl=29 i lp=470"]
[480,9.4," Wskaźnik planowanej łącznej kwoty spłaty zobowiązań, o której mowa w art. 243 ust. 1 ustawy do dochodów ogółem, bez uwzględnienia zobowiązań związku współtworzonego przez jednostkę samorządu terytorialnego, po uwzględnieniu wyłączeń przypadających na dany rok określonych w pkt 5.1.1. ","rokwzgl=0 i lp=480","rokwzgl=0 i lp=480","rokwzgl=1 i lp=480","rokwzgl=2 i lp=480","rokwzgl=3 i lp=480","rokwzgl=4 i lp=480","rokwzgl=5 i lp=480","rokwzgl=6 i lp=480","rokwzgl=7 i lp=480","rokwzgl=8 i lp=480","rokwzgl=9 i lp=480","rokwzgl=10 i lp=480","rokwzgl=11 i lp=480","rokwzgl=12 i lp=480","rokwzgl=13 i lp=480","rokwzgl=14 i lp=480","rokwzgl=15 i lp=480","rokwzgl=16 i lp=480","rokwzgl=17 i lp=480","rokwzgl=18 i lp=480","rokwzgl=19 i lp=480","rokwzgl=20 i lp=480","rokwzgl=21 i lp=480","rokwzgl=22 i lp=480","rokwzgl=23 i lp=480","rokwzgl=24 i lp=480","rokwzgl=25 i lp=480","rokwzgl=26 i lp=480","rokwzgl=27 i lp=480","rokwzgl=28 i lp=480","rokwzgl=29 i lp=480"]
[490,9.5," Kwota zobowiązań związku współtworzonego przez jednostkę samorządu terytorialnego przypadających do spłaty w danym roku budżetowym, podlegająca doliczeniu zgodnie z art. 244 ustawy ","rokwzgl=0 i lp=490","rokwzgl=0 i lp=490","rokwzgl=1 i lp=490","rokwzgl=2 i lp=490","rokwzgl=3 i lp=490","rokwzgl=4 i lp=490","rokwzgl=5 i lp=490","rokwzgl=6 i lp=490","rokwzgl=7 i lp=490","rokwzgl=8 i lp=490","rokwzgl=9 i lp=490","rokwzgl=10 i lp=490","rokwzgl=11 i lp=490","rokwzgl=12 i lp=490","rokwzgl=13 i lp=490","rokwzgl=14 i lp=490","rokwzgl=15 i lp=490","rokwzgl=16 i lp=490","rokwzgl=17 i lp=490","rokwzgl=18 i lp=490","rokwzgl=19 i lp=490","rokwzgl=20 i lp=490","rokwzgl=21 i lp=490","rokwzgl=22 i lp=490","rokwzgl=23 i lp=490","rokwzgl=24 i lp=490","rokwzgl=25 i lp=490","rokwzgl=26 i lp=490","rokwzgl=27 i lp=490","rokwzgl=28 i lp=490","rokwzgl=29 i lp=490"]
[500,9.6," Wskaźnik planowanej łącznej kwoty spłaty zobowiązań, o której mowa w art. 243 ust. 1 ustawy do dochodów ogółem, po uwzględnieniu zobowiązań związku współtworzonego przez jednostkę samorządu terytorialnego oraz po uwzględnieniu wyłączeń przypadających na dany rok określonych w pkt 5.1.1.","rokwzgl=0 i lp=500","rokwzgl=0 i lp=500","rokwzgl=1 i lp=500","rokwzgl=2 i lp=500","rokwzgl=3 i lp=500","rokwzgl=4 i lp=500","rokwzgl=5 i lp=500","rokwzgl=6 i lp=500","rokwzgl=7 i lp=500","rokwzgl=8 i lp=500","rokwzgl=9 i lp=500","rokwzgl=10 i lp=500","rokwzgl=11 i lp=500","rokwzgl=12 i lp=500","rokwzgl=13 i lp=500","rokwzgl=14 i lp=500","rokwzgl=15 i lp=500","rokwzgl=16 i lp=500","rokwzgl=17 i lp=500","rokwzgl=18 i lp=500","rokwzgl=19 i lp=500","rokwzgl=20 i lp=500","rokwzgl=21 i lp=500","rokwzgl=22 i lp=500","rokwzgl=23 i lp=500","rokwzgl=24 i lp=500","rokwzgl=25 i lp=500","rokwzgl=26 i lp=500","rokwzgl=27 i lp=500","rokwzgl=28 i lp=500","rokwzgl=29 i lp=500"]
[505,"9.6.1"," Wskaźnik jednoroczny",{"$f":"+\"rokwzgl=\"&D$9&\" i lp=\"&$A60","v":"rokwzgl=0 i lp=505"},"rokwzgl=0 i lp=505","rokwzgl=1 i lp=505","rokwzgl=2 i lp=505","rokwzgl=3 i lp=505","rokwzgl=4 i lp=505","rokwzgl=5 i lp=505","rokwzgl=6 i lp=505","rokwzgl=7 i lp=505","rokwzgl=8 i lp=505",{"$f":"+\"rokwzgl=\"&N$9&\" i lp=\"&$A60","v":"rokwzgl=9 i lp=505"},"rokwzgl=10 i lp=505","rokwzgl=11 i lp=505","rokwzgl=12 i lp=505","rokwzgl=13 i lp=505","rokwzgl=14 i lp=505","rokwzgl=15 i lp=505","rokwzgl=16 i lp=505","rokwzgl=17 i lp=505","rokwzgl=18 i lp=505",{"$f":"+\"rokwzgl=\"&X$9&\" i lp=\"&$A60","v":"rokwzgl=19 i lp=505"},"rokwzgl=20 i lp=505","rokwzgl=21 i lp=505","rokwzgl=22 i lp=505","rokwzgl=23 i lp=505","rokwzgl=24 i lp=505","rokwzgl=25 i lp=505","rokwzgl=26 i lp=505","rokwzgl=27 i lp=505","rokwzgl=28 i lp=505","rokwzgl=29 i lp=505"]
[510,9.6999999999999993," Dopuszczalny wskaźnik spłaty zobowiązań określony w art. 243 ustawy, po uwzględnieniu wyłączeń określonych w art.  36 ustawy z dnia 7 grudnia 2012 r. o zmianie niektórych ustaw związanych z realizacją ustawy budżetowej, obliczony w oparciu o plan 3 kwartałów roku poprzedzającego rok budżetowy","rokwzgl=0 i lp=510","rokwzgl=0 i lp=510","rokwzgl=1 i lp=510","rokwzgl=2 i lp=510","rokwzgl=3 i lp=510","rokwzgl=4 i lp=510","rokwzgl=5 i lp=510","rokwzgl=6 i lp=510","rokwzgl=7 i lp=510","rokwzgl=8 i lp=510","rokwzgl=9 i lp=510","rokwzgl=10 i lp=510","rokwzgl=11 i lp=510","rokwzgl=12 i lp=510","rokwzgl=13 i lp=510","rokwzgl=14 i lp=510","rokwzgl=15 i lp=510","rokwzgl=16 i lp=510","rokwzgl=17 i lp=510","rokwzgl=18 i lp=510","rokwzgl=19 i lp=510","rokwzgl=20 i lp=510","rokwzgl=21 i lp=510","rokwzgl=22 i lp=510","rokwzgl=23 i lp=510","rokwzgl=24 i lp=510","rokwzgl=25 i lp=510","rokwzgl=26 i lp=510","rokwzgl=27 i lp=510","rokwzgl=28 i lp=510","rokwzgl=29 i lp=510"]
[520,"9.7.1","  Dopuszczalny wskaźnik spłaty zobowiązań określony w art. 243 ustawy, po uwzględnieniu wyłączeń określonych w art.  36 ustawy z dnia 7 grudnia 2012 r. o zmianie niektórych ustaw związanych z realizacją ustawy budżetowej, obliczony w oparciu o wykonanie roku poprzedzającego rok budżetowy","rokwzgl=0 i lp=520","rokwzgl=0 i lp=520","rokwzgl=1 i lp=520","rokwzgl=2 i lp=520","rokwzgl=3 i lp=520","rokwzgl=4 i lp=520","rokwzgl=5 i lp=520","rokwzgl=6 i lp=520","rokwzgl=7 i lp=520","rokwzgl=8 i lp=520","rokwzgl=9 i lp=520","rokwzgl=10 i lp=520","rokwzgl=11 i lp=520","rokwzgl=12 i lp=520","rokwzgl=13 i lp=520","rokwzgl=14 i lp=520","rokwzgl=15 i lp=520","rokwzgl=16 i lp=520","rokwzgl=17 i lp=520","rokwzgl=18 i lp=520","rokwzgl=19 i lp=520","rokwzgl=20 i lp=520","rokwzgl=21 i lp=520","rokwzgl=22 i lp=520","rokwzgl=23 i lp=520","rokwzgl=24 i lp=520","rokwzgl=25 i lp=520","rokwzgl=26 i lp=520","rokwzgl=27 i lp=520","rokwzgl=28 i lp=520","rokwzgl=29 i lp=520"]
[530,9.8000000000000007," Informacja o spełnieniu wskaźnika spłaty zobowiązań określonego w art. 243 ustawy, po uwzględnieniu zobowiązań związku współtworzonego przez jednostkę samorządu terytorialnego oraz po uwzględnieniu wyłączeń określonych w pkt 5.1.1., obliczonego w oparciu o plan 3 kwartałów roku poprzedzającego rok budżetowy","rokwzgl=0 i lp=530","rokwzgl=0 i lp=530","rokwzgl=1 i lp=530","rokwzgl=2 i lp=530","rokwzgl=3 i lp=530","rokwzgl=4 i lp=530","rokwzgl=5 i lp=530","rokwzgl=6 i lp=530","rokwzgl=7 i lp=530","rokwzgl=8 i lp=530","rokwzgl=9 i lp=530","rokwzgl=10 i lp=530","rokwzgl=11 i lp=530","rokwzgl=12 i lp=530","rokwzgl=13 i lp=530","rokwzgl=14 i lp=530","rokwzgl=15 i lp=530","rokwzgl=16 i lp=530","rokwzgl=17 i lp=530","rokwzgl=18 i lp=530","rokwzgl=19 i lp=530","rokwzgl=20 i lp=530","rokwzgl=21 i lp=530","rokwzgl=22 i lp=530","rokwzgl=23 i lp=530","rokwzgl=24 i lp=530","rokwzgl=25 i lp=530","rokwzgl=26 i lp=530","rokwzgl=27 i lp=530","rokwzgl=28 i lp=530","rokwzgl=29 i lp=530"]
[540,"9.8.1","  Informacja o spełnieniu wskaźnika spłaty zobowiązań określonego w art. 243 ustawy, po uwzględnieniu zobowiązań związku współtworzonego przez jednostkę samorządu terytorialnego oraz po uwzględnieniu wyłączeń określonych w pkt 5.1.1., obliczonego w oparciu o wykonanie roku poprzedzającego rok budżetowy","rokwzgl=0 i lp=540","rokwzgl=0 i lp=540","rokwzgl=1 i lp=540","rokwzgl=2 i lp=540","rokwzgl=3 i lp=540","rokwzgl=4 i lp=540","rokwzgl=5 i lp=540","rokwzgl=6 i lp=540","rokwzgl=7 i lp=540","rokwzgl=8 i lp=540","rokwzgl=9 i lp=540","rokwzgl=10 i lp=540","rokwzgl=11 i lp=540","rokwzgl=12 i lp=540","rokwzgl=13 i lp=540","rokwzgl=14 i lp=540","rokwzgl=15 i lp=540","rokwzgl=16 i lp=540","rokwzgl=17 i lp=540","rokwzgl=18 i lp=540","rokwzgl=19 i lp=540","rokwzgl=20 i lp=540","rokwzgl=21 i lp=540","rokwzgl=22 i lp=540","rokwzgl=23 i lp=540","rokwzgl=24 i lp=540","rokwzgl=25 i lp=540","rokwzgl=26 i lp=540","rokwzgl=27 i lp=540","rokwzgl=28 i lp=540","rokwzgl=29 i lp=540"]
[550,10,"Przeznaczenie prognozowanej nadwyżki budżetowej,  w tym na:","rokwzgl=0 i lp=550","rokwzgl=0 i lp=550","rokwzgl=1 i lp=550","rokwzgl=2 i lp=550","rokwzgl=3 i lp=550","rokwzgl=4 i lp=550","rokwzgl=5 i lp=550","rokwzgl=6 i lp=550","rokwzgl=7 i lp=550","rokwzgl=8 i lp=550","rokwzgl=9 i lp=550","rokwzgl=10 i lp=550","rokwzgl=11 i lp=550","rokwzgl=12 i lp=550","rokwzgl=13 i lp=550","rokwzgl=14 i lp=550","rokwzgl=15 i lp=550","rokwzgl=16 i lp=550","rokwzgl=17 i lp=550","rokwzgl=18 i lp=550","rokwzgl=19 i lp=550","rokwzgl=20 i lp=550","rokwzgl=21 i lp=550","rokwzgl=22 i lp=550","rokwzgl=23 i lp=550","rokwzgl=24 i lp=550","rokwzgl=25 i lp=550","rokwzgl=26 i lp=550","rokwzgl=27 i lp=550","rokwzgl=28 i lp=550","rokwzgl=29 i lp=550"]
[560,10.1," Spłaty kredytów, pożyczek i wykup papierów wartościowych","rokwzgl=0 i lp=560","rokwzgl=0 i lp=560","rokwzgl=1 i lp=560","rokwzgl=2 i lp=560","rokwzgl=3 i lp=560","rokwzgl=4 i lp=560","rokwzgl=5 i lp=560","rokwzgl=6 i lp=560","rokwzgl=7 i lp=560","rokwzgl=8 i lp=560","rokwzgl=9 i lp=560","rokwzgl=10 i lp=560","rokwzgl=11 i lp=560","rokwzgl=12 i lp=560","rokwzgl=13 i lp=560","rokwzgl=14 i lp=560","rokwzgl=15 i lp=560","rokwzgl=16 i lp=560","rokwzgl=17 i lp=560","rokwzgl=18 i lp=560","rokwzgl=19 i lp=560","rokwzgl=20 i lp=560","rokwzgl=21 i lp=560","rokwzgl=22 i lp=560","rokwzgl=23 i lp=560","rokwzgl=24 i lp=560","rokwzgl=25 i lp=560","rokwzgl=26 i lp=560","rokwzgl=27 i lp=560","rokwzgl=28 i lp=560","rokwzgl=29 i lp=560"]
[570,11,"Informacje uzupełniające o wybranych rodzajach wydatków budżetowych","rokwzgl=0 i lp=570","rokwzgl=0 i lp=570","rokwzgl=1 i lp=570","rokwzgl=2 i lp=570","rokwzgl=3 i lp=570","rokwzgl=4 i lp=570","rokwzgl=5 i lp=570","rokwzgl=6 i lp=570","rokwzgl=7 i lp=570","rokwzgl=8 i lp=570","rokwzgl=9 i lp=570","rokwzgl=10 i lp=570","rokwzgl=11 i lp=570","rokwzgl=12 i lp=570","rokwzgl=13 i lp=570","rokwzgl=14 i lp=570","rokwzgl=15 i lp=570","rokwzgl=16 i lp=570","rokwzgl=17 i lp=570","rokwzgl=18 i lp=570","rokwzgl=19 i lp=570","rokwzgl=20 i lp=570","rokwzgl=21 i lp=570","rokwzgl=22 i lp=570","rokwzgl=23 i lp=570","rokwzgl=24 i lp=570","rokwzgl=25 i lp=570","rokwzgl=26 i lp=570","rokwzgl=27 i lp=570","rokwzgl=28 i lp=570","rokwzgl=29 i lp=570"]
[580,11.1," Wydatki bieżące na wynagrodzenia i składki od nich naliczane","rokwzgl=0 i lp=580","rokwzgl=0 i lp=580","rokwzgl=1 i lp=580","rokwzgl=2 i lp=580","rokwzgl=3 i lp=580","rokwzgl=4 i lp=580","rokwzgl=5 i lp=580","rokwzgl=6 i lp=580","rokwzgl=7 i lp=580","rokwzgl=8 i lp=580","rokwzgl=9 i lp=580","rokwzgl=10 i lp=580","rokwzgl=11 i lp=580","rokwzgl=12 i lp=580","rokwzgl=13 i lp=580","rokwzgl=14 i lp=580","rokwzgl=15 i lp=580","rokwzgl=16 i lp=580","rokwzgl=17 i lp=580","rokwzgl=18 i lp=580","rokwzgl=19 i lp=580","rokwzgl=20 i lp=580","rokwzgl=21 i lp=580","rokwzgl=22 i lp=580","rokwzgl=23 i lp=580","rokwzgl=24 i lp=580","rokwzgl=25 i lp=580","rokwzgl=26 i lp=580","rokwzgl=27 i lp=580","rokwzgl=28 i lp=580","rokwzgl=29 i lp=580"]
[590,11.2," Wydatki związane z funkcjonowaniem organów jednostki samorządu terytorialnego","rokwzgl=0 i lp=590","rokwzgl=0 i lp=590","rokwzgl=1 i lp=590","rokwzgl=2 i lp=590","rokwzgl=3 i lp=590","rokwzgl=4 i lp=590","rokwzgl=5 i lp=590","rokwzgl=6 i lp=590","rokwzgl=7 i lp=590","rokwzgl=8 i lp=590","rokwzgl=9 i lp=590","rokwzgl=10 i lp=590","rokwzgl=11 i lp=590","rokwzgl=12 i lp=590","rokwzgl=13 i lp=590","rokwzgl=14 i lp=590","rokwzgl=15 i lp=590","rokwzgl=16 i lp=590","rokwzgl=17 i lp=590","rokwzgl=18 i lp=590","rokwzgl=19 i lp=590","rokwzgl=20 i lp=590","rokwzgl=21 i lp=590","rokwzgl=22 i lp=590","rokwzgl=23 i lp=590","rokwzgl=24 i lp=590","rokwzgl=25 i lp=590","rokwzgl=26 i lp=590","rokwzgl=27 i lp=590","rokwzgl=28 i lp=590","rokwzgl=29 i lp=590"]
[600,11.3," Wydatki objęte limitem art. 226 ust. 3 ustawy",{"$f":"+\"rokwzgl=\"&D$9&\" i lp=\"&$A70","v":"rokwzgl=0 i lp=600"},"rokwzgl=0 i lp=600","rokwzgl=1 i lp=600","rokwzgl=2 i lp=600","rokwzgl=3 i lp=600","rokwzgl=4 i lp=600","rokwzgl=5 i lp=600","rokwzgl=6 i lp=600","rokwzgl=7 i lp=600","rokwzgl=8 i lp=600",{"$f":"+\"rokwzgl=\"&N$9&\" i lp=\"&$A70","v":"rokwzgl=9 i lp=600"},"rokwzgl=10 i lp=600","rokwzgl=11 i lp=600","rokwzgl=12 i lp=600","rokwzgl=13 i lp=600","rokwzgl=14 i lp=600","rokwzgl=15 i lp=600","rokwzgl=16 i lp=600","rokwzgl=17 i lp=600","rokwzgl=18 i lp=600",{"$f":"+\"rokwzgl=\"&X$9&\" i lp=\"&$A70","v":"rokwzgl=19 i lp=600"},"rokwzgl=20 i lp=600","rokwzgl=21 i lp=600","rokwzgl=22 i lp=600","rokwzgl=23 i lp=600","rokwzgl=24 i lp=600","rokwzgl=25 i lp=600","rokwzgl=26 i lp=600","rokwzgl=27 i lp=600","rokwzgl=28 i lp=600","rokwzgl=29 i lp=600"]
[610,"11.3.1","   bieżące","rokwzgl=0 i lp=610","rokwzgl=0 i lp=610","rokwzgl=1 i lp=610","rokwzgl=2 i lp=610","rokwzgl=3 i lp=610","rokwzgl=4 i lp=610","rokwzgl=5 i lp=610","rokwzgl=6 i lp=610","rokwzgl=7 i lp=610","rokwzgl=8 i lp=610","rokwzgl=9 i lp=610","rokwzgl=10 i lp=610","rokwzgl=11 i lp=610","rokwzgl=12 i lp=610","rokwzgl=13 i lp=610","rokwzgl=14 i lp=610","rokwzgl=15 i lp=610","rokwzgl=16 i lp=610","rokwzgl=17 i lp=610","rokwzgl=18 i lp=610","rokwzgl=19 i lp=610","rokwzgl=20 i lp=610","rokwzgl=21 i lp=610","rokwzgl=22 i lp=610","rokwzgl=23 i lp=610","rokwzgl=24 i lp=610","rokwzgl=25 i lp=610","rokwzgl=26 i lp=610","rokwzgl=27 i lp=610","rokwzgl=28 i lp=610","rokwzgl=29 i lp=610"]
[620,"11.3.2","   majątkowe","rokwzgl=0 i lp=620","rokwzgl=0 i lp=620","rokwzgl=1 i lp=620","rokwzgl=2 i lp=620","rokwzgl=3 i lp=620","rokwzgl=4 i lp=620","rokwzgl=5 i lp=620","rokwzgl=6 i lp=620","rokwzgl=7 i lp=620","rokwzgl=8 i lp=620","rokwzgl=9 i lp=620","rokwzgl=10 i lp=620","rokwzgl=11 i lp=620","rokwzgl=12 i lp=620","rokwzgl=13 i lp=620","rokwzgl=14 i lp=620","rokwzgl=15 i lp=620","rokwzgl=16 i lp=620","rokwzgl=17 i lp=620","rokwzgl=18 i lp=620","rokwzgl=19 i lp=620","rokwzgl=20 i lp=620","rokwzgl=21 i lp=620","rokwzgl=22 i lp=620","rokwzgl=23 i lp=620","rokwzgl=24 i lp=620","rokwzgl=25 i lp=620","rokwzgl=26 i lp=620","rokwzgl=27 i lp=620","rokwzgl=28 i lp=620","rokwzgl=29 i lp=620"]
[630,11.4," Wydatki inwestycyjne kontynuowane ","rokwzgl=0 i lp=630","rokwzgl=0 i lp=630","rokwzgl=1 i lp=630","rokwzgl=2 i lp=630","rokwzgl=3 i lp=630","rokwzgl=4 i lp=630","rokwzgl=5 i lp=630","rokwzgl=6 i lp=630","rokwzgl=7 i lp=630","rokwzgl=8 i lp=630","rokwzgl=9 i lp=630","rokwzgl=10 i lp=630","rokwzgl=11 i lp=630","rokwzgl=12 i lp=630","rokwzgl=13 i lp=630","rokwzgl=14 i lp=630","rokwzgl=15 i lp=630","rokwzgl=16 i lp=630","rokwzgl=17 i lp=630","rokwzgl=18 i lp=630","rokwzgl=19 i lp=630","rokwzgl=20 i lp=630","rokwzgl=21 i lp=630","rokwzgl=22 i lp=630","rokwzgl=23 i lp=630","rokwzgl=24 i lp=630","rokwzgl=25 i lp=630","rokwzgl=26 i lp=630","rokwzgl=27 i lp=630","rokwzgl=28 i lp=630","rokwzgl=29 i lp=630"]
[640,11.5," Nowe wydatki inwestycyjne","rokwzgl=0 i lp=640","rokwzgl=0 i lp=640","rokwzgl=1 i lp=640","rokwzgl=2 i lp=640","rokwzgl=3 i lp=640","rokwzgl=4 i lp=640","rokwzgl=5 i lp=640","rokwzgl=6 i lp=640","rokwzgl=7 i lp=640","rokwzgl=8 i lp=640","rokwzgl=9 i lp=640","rokwzgl=10 i lp=640","rokwzgl=11 i lp=640","rokwzgl=12 i lp=640","rokwzgl=13 i lp=640","rokwzgl=14 i lp=640","rokwzgl=15 i lp=640","rokwzgl=16 i lp=640","rokwzgl=17 i lp=640","rokwzgl=18 i lp=640","rokwzgl=19 i lp=640","rokwzgl=20 i lp=640","rokwzgl=21 i lp=640","rokwzgl=22 i lp=640","rokwzgl=23 i lp=640","rokwzgl=24 i lp=640","rokwzgl=25 i lp=640","rokwzgl=26 i lp=640","rokwzgl=27 i lp=640","rokwzgl=28 i lp=640","rokwzgl=29 i lp=640"]
[650,11.6," Wydatki majątkowe w formie dotacji ","rokwzgl=0 i lp=650","rokwzgl=0 i lp=650","rokwzgl=1 i lp=650","rokwzgl=2 i lp=650","rokwzgl=3 i lp=650","rokwzgl=4 i lp=650","rokwzgl=5 i lp=650","rokwzgl=6 i lp=650","rokwzgl=7 i lp=650","rokwzgl=8 i lp=650","rokwzgl=9 i lp=650","rokwzgl=10 i lp=650","rokwzgl=11 i lp=650","rokwzgl=12 i lp=650","rokwzgl=13 i lp=650","rokwzgl=14 i lp=650","rokwzgl=15 i lp=650","rokwzgl=16 i lp=650","rokwzgl=17 i lp=650","rokwzgl=18 i lp=650","rokwzgl=19 i lp=650","rokwzgl=20 i lp=650","rokwzgl=21 i lp=650","rokwzgl=22 i lp=650","rokwzgl=23 i lp=650","rokwzgl=24 i lp=650","rokwzgl=25 i lp=650","rokwzgl=26 i lp=650","rokwzgl=27 i lp=650","rokwzgl=28 i lp=650","rokwzgl=29 i lp=650"]
[660,12,"Finansowanie programów, projektów lub zadań realizowanych z udziałem środków, o których mowa w art. 5 ust. 1 pkt 2 i 3 ustawy","rokwzgl=0 i lp=660","rokwzgl=0 i lp=660","rokwzgl=1 i lp=660","rokwzgl=2 i lp=660","rokwzgl=3 i lp=660","rokwzgl=4 i lp=660","rokwzgl=5 i lp=660","rokwzgl=6 i lp=660","rokwzgl=7 i lp=660","rokwzgl=8 i lp=660","rokwzgl=9 i lp=660","rokwzgl=10 i lp=660","rokwzgl=11 i lp=660","rokwzgl=12 i lp=660","rokwzgl=13 i lp=660","rokwzgl=14 i lp=660","rokwzgl=15 i lp=660","rokwzgl=16 i lp=660","rokwzgl=17 i lp=660","rokwzgl=18 i lp=660","rokwzgl=19 i lp=660","rokwzgl=20 i lp=660","rokwzgl=21 i lp=660","rokwzgl=22 i lp=660","rokwzgl=23 i lp=660","rokwzgl=24 i lp=660","rokwzgl=25 i lp=660","rokwzgl=26 i lp=660","rokwzgl=27 i lp=660","rokwzgl=28 i lp=660","rokwzgl=29 i lp=660"]
[670,12.1," Dochody bieżące  na programy, projekty lub zadania finansowane z udziałem środków, o których mowa w art. 5 ust. 1 pkt 2 i 3 ustawy","rokwzgl=0 i lp=670","rokwzgl=0 i lp=670","rokwzgl=1 i lp=670","rokwzgl=2 i lp=670","rokwzgl=3 i lp=670","rokwzgl=4 i lp=670","rokwzgl=5 i lp=670","rokwzgl=6 i lp=670","rokwzgl=7 i lp=670","rokwzgl=8 i lp=670","rokwzgl=9 i lp=670","rokwzgl=10 i lp=670","rokwzgl=11 i lp=670","rokwzgl=12 i lp=670","rokwzgl=13 i lp=670","rokwzgl=14 i lp=670","rokwzgl=15 i lp=670","rokwzgl=16 i lp=670","rokwzgl=17 i lp=670","rokwzgl=18 i lp=670","rokwzgl=19 i lp=670","rokwzgl=20 i lp=670","rokwzgl=21 i lp=670","rokwzgl=22 i lp=670","rokwzgl=23 i lp=670","rokwzgl=24 i lp=670","rokwzgl=25 i lp=670","rokwzgl=26 i lp=670","rokwzgl=27 i lp=670","rokwzgl=28 i lp=670","rokwzgl=29 i lp=670"]
[680,"12.1.1","  -  w tym środki określone w art. 5 ust. 1 pkt 2 ustawy","rokwzgl=0 i lp=680","rokwzgl=0 i lp=680","rokwzgl=1 i lp=680","rokwzgl=2 i lp=680","rokwzgl=3 i lp=680","rokwzgl=4 i lp=680","rokwzgl=5 i lp=680","rokwzgl=6 i lp=680","rokwzgl=7 i lp=680","rokwzgl=8 i lp=680","rokwzgl=9 i lp=680","rokwzgl=10 i lp=680","rokwzgl=11 i lp=680","rokwzgl=12 i lp=680","rokwzgl=13 i lp=680","rokwzgl=14 i lp=680","rokwzgl=15 i lp=680","rokwzgl=16 i lp=680","rokwzgl=17 i lp=680","rokwzgl=18 i lp=680","rokwzgl=19 i lp=680","rokwzgl=20 i lp=680","rokwzgl=21 i lp=680","rokwzgl=22 i lp=680","rokwzgl=23 i lp=680","rokwzgl=24 i lp=680","rokwzgl=25 i lp=680","rokwzgl=26 i lp=680","rokwzgl=27 i lp=680","rokwzgl=28 i lp=680","rokwzgl=29 i lp=680"]
[690,"12.1.1.1","   - w tym środki określone w art. 5 ust. 1 pkt 2 ustawy wynikające wyłącznie z  zawartych umów na realizację programu, projektu lub zadania","rokwzgl=0 i lp=690","rokwzgl=0 i lp=690","rokwzgl=1 i lp=690","rokwzgl=2 i lp=690","rokwzgl=3 i lp=690","rokwzgl=4 i lp=690","rokwzgl=5 i lp=690","rokwzgl=6 i lp=690","rokwzgl=7 i lp=690","rokwzgl=8 i lp=690","rokwzgl=9 i lp=690","rokwzgl=10 i lp=690","rokwzgl=11 i lp=690","rokwzgl=12 i lp=690","rokwzgl=13 i lp=690","rokwzgl=14 i lp=690","rokwzgl=15 i lp=690","rokwzgl=16 i lp=690","rokwzgl=17 i lp=690","rokwzgl=18 i lp=690","rokwzgl=19 i lp=690","rokwzgl=20 i lp=690","rokwzgl=21 i lp=690","rokwzgl=22 i lp=690","rokwzgl=23 i lp=690","rokwzgl=24 i lp=690","rokwzgl=25 i lp=690","rokwzgl=26 i lp=690","rokwzgl=27 i lp=690","rokwzgl=28 i lp=690","rokwzgl=29 i lp=690"]
[700,12.2," Dochody majątkowe  na programy, projekty lub zadania finansowane z udziałem środków, o których mowa w art. 5 ust. 1 pkt 2 i 3 ustawy",{"$f":"+\"rokwzgl=\"&D$9&\" i lp=\"&$A80","v":"rokwzgl=0 i lp=700"},"rokwzgl=0 i lp=700","rokwzgl=1 i lp=700","rokwzgl=2 i lp=700","rokwzgl=3 i lp=700","rokwzgl=4 i lp=700","rokwzgl=5 i lp=700","rokwzgl=6 i lp=700","rokwzgl=7 i lp=700","rokwzgl=8 i lp=700",{"$f":"+\"rokwzgl=\"&N$9&\" i lp=\"&$A80","v":"rokwzgl=9 i lp=700"},"rokwzgl=10 i lp=700","rokwzgl=11 i lp=700","rokwzgl=12 i lp=700","rokwzgl=13 i lp=700","rokwzgl=14 i lp=700","rokwzgl=15 i lp=700","rokwzgl=16 i lp=700","rokwzgl=17 i lp=700","rokwzgl=18 i lp=700",{"$f":"+\"rokwzgl=\"&X$9&\" i lp=\"&$A80","v":"rokwzgl=19 i lp=700"},"rokwzgl=20 i lp=700","rokwzgl=21 i lp=700","rokwzgl=22 i lp=700","rokwzgl=23 i lp=700","rokwzgl=24 i lp=700","rokwzgl=25 i lp=700","rokwzgl=26 i lp=700","rokwzgl=27 i lp=700","rokwzgl=28 i lp=700","rokwzgl=29 i lp=700"]
[710,"12.2.1","   -  w tym środki określone w art. 5 ust. 1 pkt 2 ustawy","rokwzgl=0 i lp=710","rokwzgl=0 i lp=710","rokwzgl=1 i lp=710","rokwzgl=2 i lp=710","rokwzgl=3 i lp=710","rokwzgl=4 i lp=710","rokwzgl=5 i lp=710","rokwzgl=6 i lp=710","rokwzgl=7 i lp=710","rokwzgl=8 i lp=710","rokwzgl=9 i lp=710","rokwzgl=10 i lp=710","rokwzgl=11 i lp=710","rokwzgl=12 i lp=710","rokwzgl=13 i lp=710","rokwzgl=14 i lp=710","rokwzgl=15 i lp=710","rokwzgl=16 i lp=710","rokwzgl=17 i lp=710","rokwzgl=18 i lp=710","rokwzgl=19 i lp=710","rokwzgl=20 i lp=710","rokwzgl=21 i lp=710","rokwzgl=22 i lp=710","rokwzgl=23 i lp=710","rokwzgl=24 i lp=710","rokwzgl=25 i lp=710","rokwzgl=26 i lp=710","rokwzgl=27 i lp=710","rokwzgl=28 i lp=710","rokwzgl=29 i lp=710"]
[720,"12.2.1.1","    - w tym środki określone w art. 5 ust. 1 pkt 2 ustawy wynikające wyłącznie z zawartych umów na realizację programu, projektu lub zadania","rokwzgl=0 i lp=720","rokwzgl=0 i lp=720","rokwzgl=1 i lp=720","rokwzgl=2 i lp=720","rokwzgl=3 i lp=720","rokwzgl=4 i lp=720","rokwzgl=5 i lp=720","rokwzgl=6 i lp=720","rokwzgl=7 i lp=720","rokwzgl=8 i lp=720","rokwzgl=9 i lp=720","rokwzgl=10 i lp=720","rokwzgl=11 i lp=720","rokwzgl=12 i lp=720","rokwzgl=13 i lp=720","rokwzgl=14 i lp=720","rokwzgl=15 i lp=720","rokwzgl=16 i lp=720","rokwzgl=17 i lp=720","rokwzgl=18 i lp=720","rokwzgl=19 i lp=720","rokwzgl=20 i lp=720","rokwzgl=21 i lp=720","rokwzgl=22 i lp=720","rokwzgl=23 i lp=720","rokwzgl=24 i lp=720","rokwzgl=25 i lp=720","rokwzgl=26 i lp=720","rokwzgl=27 i lp=720","rokwzgl=28 i lp=720","rokwzgl=29 i lp=720"]
[730,12.3," Wydatki bieżące na programy, projekty lub zadania finansowane z udziałem środków, o których mowa w art. 5 ust. 1 pkt 2 i 3 ustawy","rokwzgl=0 i lp=730","rokwzgl=0 i lp=730","rokwzgl=1 i lp=730","rokwzgl=2 i lp=730","rokwzgl=3 i lp=730","rokwzgl=4 i lp=730","rokwzgl=5 i lp=730","rokwzgl=6 i lp=730","rokwzgl=7 i lp=730","rokwzgl=8 i lp=730","rokwzgl=9 i lp=730","rokwzgl=10 i lp=730","rokwzgl=11 i lp=730","rokwzgl=12 i lp=730","rokwzgl=13 i lp=730","rokwzgl=14 i lp=730","rokwzgl=15 i lp=730","rokwzgl=16 i lp=730","rokwzgl=17 i lp=730","rokwzgl=18 i lp=730","rokwzgl=19 i lp=730","rokwzgl=20 i lp=730","rokwzgl=21 i lp=730","rokwzgl=22 i lp=730","rokwzgl=23 i lp=730","rokwzgl=24 i lp=730","rokwzgl=25 i lp=730","rokwzgl=26 i lp=730","rokwzgl=27 i lp=730","rokwzgl=28 i lp=730","rokwzgl=29 i lp=730"]
[740,"12.3.1","  -  w tym finansowane środkami określonymi w art. 5 ust. 1 pkt 2 ustawy ","rokwzgl=0 i lp=740","rokwzgl=0 i lp=740","rokwzgl=1 i lp=740","rokwzgl=2 i lp=740","rokwzgl=3 i lp=740","rokwzgl=4 i lp=740","rokwzgl=5 i lp=740","rokwzgl=6 i lp=740","rokwzgl=7 i lp=740","rokwzgl=8 i lp=740","rokwzgl=9 i lp=740","rokwzgl=10 i lp=740","rokwzgl=11 i lp=740","rokwzgl=12 i lp=740","rokwzgl=13 i lp=740","rokwzgl=14 i lp=740","rokwzgl=15 i lp=740","rokwzgl=16 i lp=740","rokwzgl=17 i lp=740","rokwzgl=18 i lp=740","rokwzgl=19 i lp=740","rokwzgl=20 i lp=740","rokwzgl=21 i lp=740","rokwzgl=22 i lp=740","rokwzgl=23 i lp=740","rokwzgl=24 i lp=740","rokwzgl=25 i lp=740","rokwzgl=26 i lp=740","rokwzgl=27 i lp=740","rokwzgl=28 i lp=740","rokwzgl=29 i lp=740"]
[750,"12.3.2","  Wydatki bieżące na realizację programu, projektu lub zadania wynikające wyłącznie z zawartych umów z podmiotem dysponującym środkami, o których mowa w art. 5 ust. 1 pkt 2 ustawy ","rokwzgl=0 i lp=750","rokwzgl=0 i lp=750","rokwzgl=1 i lp=750","rokwzgl=2 i lp=750","rokwzgl=3 i lp=750","rokwzgl=4 i lp=750","rokwzgl=5 i lp=750","rokwzgl=6 i lp=750","rokwzgl=7 i lp=750","rokwzgl=8 i lp=750","rokwzgl=9 i lp=750","rokwzgl=10 i lp=750","rokwzgl=11 i lp=750","rokwzgl=12 i lp=750","rokwzgl=13 i lp=750","rokwzgl=14 i lp=750","rokwzgl=15 i lp=750","rokwzgl=16 i lp=750","rokwzgl=17 i lp=750","rokwzgl=18 i lp=750","rokwzgl=19 i lp=750","rokwzgl=20 i lp=750","rokwzgl=21 i lp=750","rokwzgl=22 i lp=750","rokwzgl=23 i lp=750","rokwzgl=24 i lp=750","rokwzgl=25 i lp=750","rokwzgl=26 i lp=750","rokwzgl=27 i lp=750","rokwzgl=28 i lp=750","rokwzgl=29 i lp=750"]
[760,12.4," Wydatki majątkowe na programy, projekty lub zadania finansowane z udziałem środków, o których mowa w art. 5 ust. 1 pkt 2 i 3 ustawy","rokwzgl=0 i lp=760","rokwzgl=0 i lp=760","rokwzgl=1 i lp=760","rokwzgl=2 i lp=760","rokwzgl=3 i lp=760","rokwzgl=4 i lp=760","rokwzgl=5 i lp=760","rokwzgl=6 i lp=760","rokwzgl=7 i lp=760","rokwzgl=8 i lp=760","rokwzgl=9 i lp=760","rokwzgl=10 i lp=760","rokwzgl=11 i lp=760","rokwzgl=12 i lp=760","rokwzgl=13 i lp=760","rokwzgl=14 i lp=760","rokwzgl=15 i lp=760","rokwzgl=16 i lp=760","rokwzgl=17 i lp=760","rokwzgl=18 i lp=760","rokwzgl=19 i lp=760","rokwzgl=20 i lp=760","rokwzgl=21 i lp=760","rokwzgl=22 i lp=760","rokwzgl=23 i lp=760","rokwzgl=24 i lp=760","rokwzgl=25 i lp=760","rokwzgl=26 i lp=760","rokwzgl=27 i lp=760","rokwzgl=28 i lp=760","rokwzgl=29 i lp=760"]
[770,"12.4.1","  -  w tym finansowane środkami określonymi w art. 5 ust. 1 pkt 2 ustawy","rokwzgl=0 i lp=770","rokwzgl=0 i lp=770","rokwzgl=1 i lp=770","rokwzgl=2 i lp=770","rokwzgl=3 i lp=770","rokwzgl=4 i lp=770","rokwzgl=5 i lp=770","rokwzgl=6 i lp=770","rokwzgl=7 i lp=770","rokwzgl=8 i lp=770","rokwzgl=9 i lp=770","rokwzgl=10 i lp=770","rokwzgl=11 i lp=770","rokwzgl=12 i lp=770","rokwzgl=13 i lp=770","rokwzgl=14 i lp=770","rokwzgl=15 i lp=770","rokwzgl=16 i lp=770","rokwzgl=17 i lp=770","rokwzgl=18 i lp=770","rokwzgl=19 i lp=770","rokwzgl=20 i lp=770","rokwzgl=21 i lp=770","rokwzgl=22 i lp=770","rokwzgl=23 i lp=770","rokwzgl=24 i lp=770","rokwzgl=25 i lp=770","rokwzgl=26 i lp=770","rokwzgl=27 i lp=770","rokwzgl=28 i lp=770","rokwzgl=29 i lp=770"]
[780,"12.4.2","  Wydatki majątkowe na realizację programu, projektu lub zadania wynikające wyłącznie z zawartych umów z podmiotem dysponującym środkami, o których mowa w art. 5 ust. 1 pkt 2 ustawy ","rokwzgl=0 i lp=780","rokwzgl=0 i lp=780","rokwzgl=1 i lp=780","rokwzgl=2 i lp=780","rokwzgl=3 i lp=780","rokwzgl=4 i lp=780","rokwzgl=5 i lp=780","rokwzgl=6 i lp=780","rokwzgl=7 i lp=780","rokwzgl=8 i lp=780","rokwzgl=9 i lp=780","rokwzgl=10 i lp=780","rokwzgl=11 i lp=780","rokwzgl=12 i lp=780","rokwzgl=13 i lp=780","rokwzgl=14 i lp=780","rokwzgl=15 i lp=780","rokwzgl=16 i lp=780","rokwzgl=17 i lp=780","rokwzgl=18 i lp=780","rokwzgl=19 i lp=780","rokwzgl=20 i lp=780","rokwzgl=21 i lp=780","rokwzgl=22 i lp=780","rokwzgl=23 i lp=780","rokwzgl=24 i lp=780","rokwzgl=25 i lp=780","rokwzgl=26 i lp=780","rokwzgl=27 i lp=780","rokwzgl=28 i lp=780","rokwzgl=29 i lp=780"]
[790,13,"Kwoty dotyczące przejęcia i spłaty zobowiązań po samodzielnych publicznych zakładach opieki zdrowotnej oraz pokrycia ujemnego wyniku ","rokwzgl=0 i lp=790","rokwzgl=0 i lp=790","rokwzgl=1 i lp=790","rokwzgl=2 i lp=790","rokwzgl=3 i lp=790","rokwzgl=4 i lp=790","rokwzgl=5 i lp=790","rokwzgl=6 i lp=790","rokwzgl=7 i lp=790","rokwzgl=8 i lp=790","rokwzgl=9 i lp=790","rokwzgl=10 i lp=790","rokwzgl=11 i lp=790","rokwzgl=12 i lp=790","rokwzgl=13 i lp=790","rokwzgl=14 i lp=790","rokwzgl=15 i lp=790","rokwzgl=16 i lp=790","rokwzgl=17 i lp=790","rokwzgl=18 i lp=790","rokwzgl=19 i lp=790","rokwzgl=20 i lp=790","rokwzgl=21 i lp=790","rokwzgl=22 i lp=790","rokwzgl=23 i lp=790","rokwzgl=24 i lp=790","rokwzgl=25 i lp=790","rokwzgl=26 i lp=790","rokwzgl=27 i lp=790","rokwzgl=28 i lp=790","rokwzgl=29 i lp=790"]
[800,13.1," Kwota zobowiązań wynikających z przejęcia przez jednostkę samorządu terytorialnego zobowiązań po likwidowanych i przekształcanych samodzielnych zakładach opieki zdrowotnej",{"$f":"+\"rokwzgl=\"&D$9&\" i lp=\"&$A90","v":"rokwzgl=0 i lp=800"},"rokwzgl=0 i lp=800","rokwzgl=1 i lp=800","rokwzgl=2 i lp=800","rokwzgl=3 i lp=800","rokwzgl=4 i lp=800","rokwzgl=5 i lp=800","rokwzgl=6 i lp=800","rokwzgl=7 i lp=800","rokwzgl=8 i lp=800",{"$f":"+\"rokwzgl=\"&N$9&\" i lp=\"&$A90","v":"rokwzgl=9 i lp=800"},"rokwzgl=10 i lp=800","rokwzgl=11 i lp=800","rokwzgl=12 i lp=800","rokwzgl=13 i lp=800","rokwzgl=14 i lp=800","rokwzgl=15 i lp=800","rokwzgl=16 i lp=800","rokwzgl=17 i lp=800","rokwzgl=18 i lp=800",{"$f":"+\"rokwzgl=\"&X$9&\" i lp=\"&$A90","v":"rokwzgl=19 i lp=800"},"rokwzgl=20 i lp=800","rokwzgl=21 i lp=800","rokwzgl=22 i lp=800","rokwzgl=23 i lp=800","rokwzgl=24 i lp=800","rokwzgl=25 i lp=800","rokwzgl=26 i lp=800","rokwzgl=27 i lp=800","rokwzgl=28 i lp=800","rokwzgl=29 i lp=800"]
[810,13.2," Dochody budżetowe z tytułu dotacji celowej z budżetu państwa, o której mowa w art. 196 ustawy z  dnia 15 kwietnia 2011 r.  o działalności leczniczej (Dz.U. Nr 112, poz. 654, z późn. zm.)","rokwzgl=0 i lp=810","rokwzgl=0 i lp=810","rokwzgl=1 i lp=810","rokwzgl=2 i lp=810","rokwzgl=3 i lp=810","rokwzgl=4 i lp=810","rokwzgl=5 i lp=810","rokwzgl=6 i lp=810","rokwzgl=7 i lp=810","rokwzgl=8 i lp=810","rokwzgl=9 i lp=810","rokwzgl=10 i lp=810","rokwzgl=11 i lp=810","rokwzgl=12 i lp=810","rokwzgl=13 i lp=810","rokwzgl=14 i lp=810","rokwzgl=15 i lp=810","rokwzgl=16 i lp=810","rokwzgl=17 i lp=810","rokwzgl=18 i lp=810","rokwzgl=19 i lp=810","rokwzgl=20 i lp=810","rokwzgl=21 i lp=810","rokwzgl=22 i lp=810","rokwzgl=23 i lp=810","rokwzgl=24 i lp=810","rokwzgl=25 i lp=810","rokwzgl=26 i lp=810","rokwzgl=27 i lp=810","rokwzgl=28 i lp=810","rokwzgl=29 i lp=810"]
[820,13.3," Wysokość zobowiązań podlegających umorzeniu, o którym mowa w art. 190 ustawy o działalności leczniczej","rokwzgl=0 i lp=820","rokwzgl=0 i lp=820","rokwzgl=1 i lp=820","rokwzgl=2 i lp=820","rokwzgl=3 i lp=820","rokwzgl=4 i lp=820","rokwzgl=5 i lp=820","rokwzgl=6 i lp=820","rokwzgl=7 i lp=820","rokwzgl=8 i lp=820","rokwzgl=9 i lp=820","rokwzgl=10 i lp=820","rokwzgl=11 i lp=820","rokwzgl=12 i lp=820","rokwzgl=13 i lp=820","rokwzgl=14 i lp=820","rokwzgl=15 i lp=820","rokwzgl=16 i lp=820","rokwzgl=17 i lp=820","rokwzgl=18 i lp=820","rokwzgl=19 i lp=820","rokwzgl=20 i lp=820","rokwzgl=21 i lp=820","rokwzgl=22 i lp=820","rokwzgl=23 i lp=820","rokwzgl=24 i lp=820","rokwzgl=25 i lp=820","rokwzgl=26 i lp=820","rokwzgl=27 i lp=820","rokwzgl=28 i lp=820","rokwzgl=29 i lp=820"]
[830,13.4," Wydatki na spłatę przejętych zobowiązań samodzielnego publicznego zakładu opieki zdrowotnej przekształconego na zasadach określonych w przepisach  o działalności leczniczej","rokwzgl=0 i lp=830","rokwzgl=0 i lp=830","rokwzgl=1 i lp=830","rokwzgl=2 i lp=830","rokwzgl=3 i lp=830","rokwzgl=4 i lp=830","rokwzgl=5 i lp=830","rokwzgl=6 i lp=830","rokwzgl=7 i lp=830","rokwzgl=8 i lp=830","rokwzgl=9 i lp=830","rokwzgl=10 i lp=830","rokwzgl=11 i lp=830","rokwzgl=12 i lp=830","rokwzgl=13 i lp=830","rokwzgl=14 i lp=830","rokwzgl=15 i lp=830","rokwzgl=16 i lp=830","rokwzgl=17 i lp=830","rokwzgl=18 i lp=830","rokwzgl=19 i lp=830","rokwzgl=20 i lp=830","rokwzgl=21 i lp=830","rokwzgl=22 i lp=830","rokwzgl=23 i lp=830","rokwzgl=24 i lp=830","rokwzgl=25 i lp=830","rokwzgl=26 i lp=830","rokwzgl=27 i lp=830","rokwzgl=28 i lp=830","rokwzgl=29 i lp=830"]
[840,13.5," Wydatki na spłatę przejętych zobowiązań samodzielnego publicznego zakładu opieki zdrowotnej likwidowanego na zasadach określonych w przepisach  o działalności leczniczej","rokwzgl=0 i lp=840","rokwzgl=0 i lp=840","rokwzgl=1 i lp=840","rokwzgl=2 i lp=840","rokwzgl=3 i lp=840","rokwzgl=4 i lp=840","rokwzgl=5 i lp=840","rokwzgl=6 i lp=840","rokwzgl=7 i lp=840","rokwzgl=8 i lp=840","rokwzgl=9 i lp=840","rokwzgl=10 i lp=840","rokwzgl=11 i lp=840","rokwzgl=12 i lp=840","rokwzgl=13 i lp=840","rokwzgl=14 i lp=840","rokwzgl=15 i lp=840","rokwzgl=16 i lp=840","rokwzgl=17 i lp=840","rokwzgl=18 i lp=840","rokwzgl=19 i lp=840","rokwzgl=20 i lp=840","rokwzgl=21 i lp=840","rokwzgl=22 i lp=840","rokwzgl=23 i lp=840","rokwzgl=24 i lp=840","rokwzgl=25 i lp=840","rokwzgl=26 i lp=840","rokwzgl=27 i lp=840","rokwzgl=28 i lp=840","rokwzgl=29 i lp=840"]
[850,13.6," Wydatki na spłatę zobowiązań samodzielnego publicznego zakładu opieki zdrowotnej przejętych do końca 2011 r. na podstawie przepisów o zakładach opieki zdrowotnej","rokwzgl=0 i lp=850","rokwzgl=0 i lp=850","rokwzgl=1 i lp=850","rokwzgl=2 i lp=850","rokwzgl=3 i lp=850","rokwzgl=4 i lp=850","rokwzgl=5 i lp=850","rokwzgl=6 i lp=850","rokwzgl=7 i lp=850","rokwzgl=8 i lp=850","rokwzgl=9 i lp=850","rokwzgl=10 i lp=850","rokwzgl=11 i lp=850","rokwzgl=12 i lp=850","rokwzgl=13 i lp=850","rokwzgl=14 i lp=850","rokwzgl=15 i lp=850","rokwzgl=16 i lp=850","rokwzgl=17 i lp=850","rokwzgl=18 i lp=850","rokwzgl=19 i lp=850","rokwzgl=20 i lp=850","rokwzgl=21 i lp=850","rokwzgl=22 i lp=850","rokwzgl=23 i lp=850","rokwzgl=24 i lp=850","rokwzgl=25 i lp=850","rokwzgl=26 i lp=850","rokwzgl=27 i lp=850","rokwzgl=28 i lp=850","rokwzgl=29 i lp=850"]
[860,13.7," Wydatki bieżące na pokrycie ujemnego wyniku finansowego samodzielnego publicznego zakładu opieki zdrowotnej","rokwzgl=0 i lp=860","rokwzgl=0 i lp=860","rokwzgl=1 i lp=860","rokwzgl=2 i lp=860","rokwzgl=3 i lp=860","rokwzgl=4 i lp=860","rokwzgl=5 i lp=860","rokwzgl=6 i lp=860","rokwzgl=7 i lp=860","rokwzgl=8 i lp=860","rokwzgl=9 i lp=860","rokwzgl=10 i lp=860","rokwzgl=11 i lp=860","rokwzgl=12 i lp=860","rokwzgl=13 i lp=860","rokwzgl=14 i lp=860","rokwzgl=15 i lp=860","rokwzgl=16 i lp=860","rokwzgl=17 i lp=860","rokwzgl=18 i lp=860","rokwzgl=19 i lp=860","rokwzgl=20 i lp=860","rokwzgl=21 i lp=860","rokwzgl=22 i lp=860","rokwzgl=23 i lp=860","rokwzgl=24 i lp=860","rokwzgl=25 i lp=860","rokwzgl=26 i lp=860","rokwzgl=27 i lp=860","rokwzgl=28 i lp=860","rokwzgl=29 i lp=860"]
[870,14,"Dane uzupełniające o długu i jego spłacie","rokwzgl=0 i lp=870","rokwzgl=0 i lp=870","rokwzgl=1 i lp=870","rokwzgl=2 i lp=870","rokwzgl=3 i lp=870","rokwzgl=4 i lp=870","rokwzgl=5 i lp=870","rokwzgl=6 i lp=870","rokwzgl=7 i lp=870","rokwzgl=8 i lp=870","rokwzgl=9 i lp=870","rokwzgl=10 i lp=870","rokwzgl=11 i lp=870","rokwzgl=12 i lp=870","rokwzgl=13 i lp=870","rokwzgl=14 i lp=870","rokwzgl=15 i lp=870","rokwzgl=16 i lp=870","rokwzgl=17 i lp=870","rokwzgl=18 i lp=870","rokwzgl=19 i lp=870","rokwzgl=20 i lp=870","rokwzgl=21 i lp=870","rokwzgl=22 i lp=870","rokwzgl=23 i lp=870","rokwzgl=24 i lp=870","rokwzgl=25 i lp=870","rokwzgl=26 i lp=870","rokwzgl=27 i lp=870","rokwzgl=28 i lp=870","rokwzgl=29 i lp=870"]
[880,14.1," Spłaty rat kapitałowych oraz wykup papierów wartościowych, o których mowa w pkt. 5.1., wynikające wyłącznie z tytułu zobowiązań już zaciągniętych","rokwzgl=0 i lp=880","rokwzgl=0 i lp=880","rokwzgl=1 i lp=880","rokwzgl=2 i lp=880","rokwzgl=3 i lp=880","rokwzgl=4 i lp=880","rokwzgl=5 i lp=880","rokwzgl=6 i lp=880","rokwzgl=7 i lp=880","rokwzgl=8 i lp=880","rokwzgl=9 i lp=880","rokwzgl=10 i lp=880","rokwzgl=11 i lp=880","rokwzgl=12 i lp=880","rokwzgl=13 i lp=880","rokwzgl=14 i lp=880","rokwzgl=15 i lp=880","rokwzgl=16 i lp=880","rokwzgl=17 i lp=880","rokwzgl=18 i lp=880","rokwzgl=19 i lp=880","rokwzgl=20 i lp=880","rokwzgl=21 i lp=880","rokwzgl=22 i lp=880","rokwzgl=23 i lp=880","rokwzgl=24 i lp=880","rokwzgl=25 i lp=880","rokwzgl=26 i lp=880","rokwzgl=27 i lp=880","rokwzgl=28 i lp=880","rokwzgl=29 i lp=880"]
[890,14.2," Kwota długu, którego planowana spłata dokona się z wydatków budżetu","rokwzgl=0 i lp=890","rokwzgl=0 i lp=890","rokwzgl=1 i lp=890","rokwzgl=2 i lp=890","rokwzgl=3 i lp=890","rokwzgl=4 i lp=890","rokwzgl=5 i lp=890","rokwzgl=6 i lp=890","rokwzgl=7 i lp=890","rokwzgl=8 i lp=890","rokwzgl=9 i lp=890","rokwzgl=10 i lp=890","rokwzgl=11 i lp=890","rokwzgl=12 i lp=890","rokwzgl=13 i lp=890","rokwzgl=14 i lp=890","rokwzgl=15 i lp=890","rokwzgl=16 i lp=890","rokwzgl=17 i lp=890","rokwzgl=18 i lp=890","rokwzgl=19 i lp=890","rokwzgl=20 i lp=890","rokwzgl=21 i lp=890","rokwzgl=22 i lp=890","rokwzgl=23 i lp=890","rokwzgl=24 i lp=890","rokwzgl=25 i lp=890","rokwzgl=26 i lp=890","rokwzgl=27 i lp=890","rokwzgl=28 i lp=890","rokwzgl=29 i lp=890"]
[900,14.3," Wydatki zmniejszające dług, w tym","rokwzgl=0 i lp=900","rokwzgl=0 i lp=900","rokwzgl=1 i lp=900","rokwzgl=2 i lp=900","rokwzgl=3 i lp=900","rokwzgl=4 i lp=900","rokwzgl=5 i lp=900","rokwzgl=6 i lp=900","rokwzgl=7 i lp=900","rokwzgl=8 i lp=900","rokwzgl=9 i lp=900","rokwzgl=10 i lp=900","rokwzgl=11 i lp=900","rokwzgl=12 i lp=900","rokwzgl=13 i lp=900","rokwzgl=14 i lp=900","rokwzgl=15 i lp=900","rokwzgl=16 i lp=900","rokwzgl=17 i lp=900","rokwzgl=18 i lp=900","rokwzgl=19 i lp=900","rokwzgl=20 i lp=900","rokwzgl=21 i lp=900","rokwzgl=22 i lp=900","rokwzgl=23 i lp=900","rokwzgl=24 i lp=900","rokwzgl=25 i lp=900","rokwzgl=26 i lp=900","rokwzgl=27 i lp=900","rokwzgl=28 i lp=900","rokwzgl=29 i lp=900"]
[910,"14.3.1","  spłata zobowiązań wymagalnych z lat poprzednich, innych niż w pkt 14.3.3","rokwzgl=0 i lp=910","rokwzgl=0 i lp=910","rokwzgl=1 i lp=910","rokwzgl=2 i lp=910","rokwzgl=3 i lp=910","rokwzgl=4 i lp=910","rokwzgl=5 i lp=910","rokwzgl=6 i lp=910","rokwzgl=7 i lp=910","rokwzgl=8 i lp=910","rokwzgl=9 i lp=910","rokwzgl=10 i lp=910","rokwzgl=11 i lp=910","rokwzgl=12 i lp=910","rokwzgl=13 i lp=910","rokwzgl=14 i lp=910","rokwzgl=15 i lp=910","rokwzgl=16 i lp=910","rokwzgl=17 i lp=910","rokwzgl=18 i lp=910","rokwzgl=19 i lp=910","rokwzgl=20 i lp=910","rokwzgl=21 i lp=910","rokwzgl=22 i lp=910","rokwzgl=23 i lp=910","rokwzgl=24 i lp=910","rokwzgl=25 i lp=910","rokwzgl=26 i lp=910","rokwzgl=27 i lp=910","rokwzgl=28 i lp=910","rokwzgl=29 i lp=910"]
[920,"14.3.2","  związane z umowami zaliczanymi do tytułów dłużnych wliczanych w państwowy dług publiczny","rokwzgl=0 i lp=920","rokwzgl=0 i lp=920","rokwzgl=1 i lp=920","rokwzgl=2 i lp=920","rokwzgl=3 i lp=920","rokwzgl=4 i lp=920","rokwzgl=5 i lp=920","rokwzgl=6 i lp=920","rokwzgl=7 i lp=920","rokwzgl=8 i lp=920","rokwzgl=9 i lp=920","rokwzgl=10 i lp=920","rokwzgl=11 i lp=920","rokwzgl=12 i lp=920","rokwzgl=13 i lp=920","rokwzgl=14 i lp=920","rokwzgl=15 i lp=920","rokwzgl=16 i lp=920","rokwzgl=17 i lp=920","rokwzgl=18 i lp=920","rokwzgl=19 i lp=920","rokwzgl=20 i lp=920","rokwzgl=21 i lp=920","rokwzgl=22 i lp=920","rokwzgl=23 i lp=920","rokwzgl=24 i lp=920","rokwzgl=25 i lp=920","rokwzgl=26 i lp=920","rokwzgl=27 i lp=920","rokwzgl=28 i lp=920","rokwzgl=29 i lp=920"]
[930,"14.3.3","  wypłaty z tytułu wymagalnych poręczeń i gwarancji","rokwzgl=0 i lp=930","rokwzgl=0 i lp=930","rokwzgl=1 i lp=930","rokwzgl=2 i lp=930","rokwzgl=3 i lp=930","rokwzgl=4 i lp=930","rokwzgl=5 i lp=930","rokwzgl=6 i lp=930","rokwzgl=7 i lp=930","rokwzgl=8 i lp=930","rokwzgl=9 i lp=930","rokwzgl=10 i lp=930","rokwzgl=11 i lp=930","rokwzgl=12 i lp=930","rokwzgl=13 i lp=930","rokwzgl=14 i lp=930","rokwzgl=15 i lp=930","rokwzgl=16 i lp=930","rokwzgl=17 i lp=930","rokwzgl=18 i lp=930","rokwzgl=19 i lp=930","rokwzgl=20 i lp=930","rokwzgl=21 i lp=930","rokwzgl=22 i lp=930","rokwzgl=23 i lp=930","rokwzgl=24 i lp=930","rokwzgl=25 i lp=930","rokwzgl=26 i lp=930","rokwzgl=27 i lp=930","rokwzgl=28 i lp=930","rokwzgl=29 i lp=930"]
[940,14.4," Wynik operacji niekasowych wpływających na kwotę długu ( m.in. umorzenia, różnice kursowe)","rokwzgl=0 i lp=940","rokwzgl=0 i lp=940","rokwzgl=1 i lp=940","rokwzgl=2 i lp=940","rokwzgl=3 i lp=940","rokwzgl=4 i lp=940","rokwzgl=5 i lp=940","rokwzgl=6 i lp=940","rokwzgl=7 i lp=940","rokwzgl=8 i lp=940","rokwzgl=9 i lp=940","rokwzgl=10 i lp=940","rokwzgl=11 i lp=940","rokwzgl=12 i lp=940","rokwzgl=13 i lp=940","rokwzgl=14 i lp=940","rokwzgl=15 i lp=940","rokwzgl=16 i lp=940","rokwzgl=17 i lp=940","rokwzgl=18 i lp=940","rokwzgl=19 i lp=940","rokwzgl=20 i lp=940","rokwzgl=21 i lp=940","rokwzgl=22 i lp=940","rokwzgl=23 i lp=940","rokwzgl=24 i lp=940","rokwzgl=25 i lp=940","rokwzgl=26 i lp=940","rokwzgl=27 i lp=940","rokwzgl=28 i lp=940","rokwzgl=29 i lp=940"]

{"sheet":"DaneZrodlowe","index":2,"n_rows":448,"n_cols":17,"rows_kept":448,"cut":false,"hidden":true,"merged":[]}
["Wyciąg danych z tabeli \"Wieloletnia prognoza finansowa\" wprowadzonych do systemu BESTI@ z wybranej uchwały ",null,null,null,null,null,null,null,null,null,null,null,"Rok bazowy:",{"$f":"MIN(M:M)","v":2013},null,"Rok max",{"$f":"MAX(M:M)","v":2023}]
[]
["budzet","numer","nazwajst","kodgus","gt","mswia","lp","symbol","formula","wyszczegolnienie","wsk243","rokwzgl","rokprognozy","prognoza","DataPodjecia","DataWejscia"]
[2013,"Uchwała z 31.10.2013r.","BRZEZINY",1021011,1,null,670,12.1,null," Dochody bieżące  na programy, projekty lub zadania finansowane z udziałem środków, o których mowa w art. 5 ust. 1 pkt 2 i 3 ustawy",true,1,2014,222594.71,"2013-10-31","2013-10-31"]
[2013,"Uchwała z 31.10.2013r.","BRZEZINY",1021011,1,null,670,12.1,null," Dochody bieżące  na programy, projekty lub zadania finansowane z udziałem środków, o których mowa w art. 5 ust. 1 pkt 2 i 3 ustawy",true,0,2013,1959769.75,"2013-10-31","2013-10-31"]
[2013,"Uchwała z 31.10.2013r.","BRZEZINY",1021011,1,null,610,"11.3.1",null,"   bieżące",true,6,2019,56,"2013-10-31","2013-10-31"]
[2013,"Uchwała z 31.10.2013r.","BRZEZINY",1021011,1,null,610,"11.3.1",null,"   bieżące",true,4,2017,56,"2013-10-31","2013-10-31"]
[2013,"Uchwała z 31.10.2013r.","BRZEZINY",1021011,1,null,610,"11.3.1",null,"   bieżące",true,3,2016,56,"2013-10-31","2013-10-31"]
[2013,"Uchwała z 31.10.2013r.","BRZEZINY",1021011,1,null,610,"11.3.1",null,"   bieżące",true,7,2020,20,"2013-10-31","2013-10-31"]
[2013,"Uchwała z 31.10.2013r.","BRZEZINY",1021011,1,null,610,"11.3.1",null,"   bieżące",true,2,2015,449902.82,"2013-10-31","2013-10-31"]
[2013,"Uchwała z 31.10.2013r.","BRZEZINY",1021011,1,null,610,"11.3.1",null,"   bieżące",true,5,2018,56,"2013-10-31","2013-10-31"]
[2013,"Uchwała z 31.10.2013r.","BRZEZINY",1021011,1,null,610,"11.3.1",null,"   bieżące",true,0,2013,1322372.51,"2013-10-31","2013-10-31"]
[2013,"Uchwała z 31.10.2013r.","BRZEZINY",1021011,1,null,610,"11.3.1",null,"   bieżące",true,1,2014,2157115.13,"2013-10-31","2013-10-31"]
[2013,"Uchwała z 31.10.2013r.","BRZEZINY",1021011,1,null,750,"12.3.2",null,"  Wydatki bieżące na realizację programu, projektu lub zadania wynikające wyłącznie z zawartych umów z podmiotem dysponującym środkami, o których mowa w art. 5 ust. 1 pkt 2 ustawy ",false,0,2013,1974899.23,"2013-10-31","2013-10-31"]
[2013,"Uchwała z 31.10.2013r.","BRZEZINY",1021011,1,null,310,5.0999999999999996,null," Spłaty rat kapitałowych kredytów i pożyczek oraz wykup papierów wartościowych",true,0,2013,4710000,"2013-10-31","2013-10-31"]
[2013,"Uchwała z 31.10.2013r.","BRZEZINY",1021011,1,null,310,5.0999999999999996,null," Spłaty rat kapitałowych kredytów i pożyczek oraz wykup papierów wartościowych",true,1,2014,938060.16,"2013-10-31","2013-10-31"]
[2013,"Uchwała z 31.10.2013r.","BRZEZINY",1021011,1,null,310,5.0999999999999996,null," Spłaty rat kapitałowych kredytów i pożyczek oraz wykup papierów wartościowych",true,6,2019,1610004,"2013-10-31","2013-10-31"]
[2013,"Uchwała z 31.10.2013r.","BRZEZINY",1021011,1,null,310,5.0999999999999996,null," Spłaty rat kapitałowych kredytów i pożyczek oraz wykup papierów wartościowych",true,3,2016,1565696,"2013-10-31","2013-10-31"]
[2013,"Uchwała z 31.10.2013r.","BRZEZINY",1021011,1,null,310,5.0999999999999996,null," Spłaty rat kapitałowych kredytów i pożyczek oraz wykup papierów wartościowych",true,8,2021,1610004,"2013-10-31","2013-10-31"]
[2013,"Uchwała z 31.10.2013r.","BRZEZINY",1021011,1,null,310,5.0999999999999996,null," Spłaty rat kapitałowych kredytów i pożyczek oraz wykup papierów wartościowych",true,10,2023,1710000,"2013-10-31","2013-10-31"]
[2013,"Uchwała z 31.10.2013r.","BRZEZINY",1021011,1,null,310,5.0999999999999996,null," Spłaty rat kapitałowych kredytów i pożyczek oraz wykup papierów wartościowych",true,7,2020,1610004,"2013-10-31","2013-10-31"]
[2013,"Uchwała z 31.10.2013r.","BRZEZINY",1021011,1,null,310,5.0999999999999996,null," Spłaty rat kapitałowych kredytów i pożyczek oraz wykup papierów wartościowych",true,5,2018,1678204,"2013-10-31","2013-10-31"]
[2013,"Uchwała z 31.10.2013r.","BRZEZINY",1021011,1,null,310,5.0999999999999996,null," Spłaty rat kapitałowych kredytów i pożyczek oraz wykup papierów wartościowych",true,2,2015,1215692,"2013-10-31","2013-10-31"]
[2013,"Uchwała z 31.10.2013r.","BRZEZINY",1021011,1,null,310,5.0999999999999996,null," Spłaty rat kapitałowych kredytów i pożyczek oraz wykup papierów wartościowych",true,4,2017,1915700,"2013-10-31","2013-10-31"]
[2013,"Uchwała z 31.10.2013r.","BRZEZINY",1021011,1,null,310,5.0999999999999996,null," Spłaty rat kapitałowych kredytów i pożyczek oraz wykup papierów wartościowych",true,9,2022,1650004,"2013-10-31","2013-10-31"]
[2013,"Uchwała z 31.10.2013r.","BRZEZINY",1021011,1,null,90,1.2,null,"  Dochody majątkowe, w tym",true,0,2013,4674343.3600000003,"2013-10-31","2013-10-31"]
[2013,"Uchwała z 31.10.2013r.","BRZEZINY",1021011,1,null,500,9.6,"([2.1.1]+[2.1.3.1] + [5.1]+[9.5]-[5.1.1]- [2.1.1.1] )/[1]"," Wskaźnik planowanej łącznej kwoty spłaty zobowiązań, o której mowa w art. 243 ust. 1 ustawy do dochodów ogółem, po uwzględnieniu zobowiązań związku współtworzonego przez jednostkę samorządu terytorialnego oraz po uwzględnieniu wyłączeń przypadających na dany rok określonych w pkt 5.1.1.",false,10,2023,5.2499999999999998E-2,"2013-10-31","2013-10-31"]
[2013,"Uchwała z 31.10.2013r.","BRZEZINY",1021011,1,null,260,4.3,null,"  Kredyty, pożyczki, emisja papierów wartościowych",true,0,2013,4710000,"2013-10-31","2013-10-31"]
[2013,"Uchwała z 31.10.2013r.","BRZEZINY",1021011,1,null,600,11.3,"[11.3.1] + [11.3.2]"," Wydatki objęte limitem art. 226 ust. 3 ustawy",true,1,2014,5777805.4299999997,"2013-10-31","2013-10-31"]
[2013,"Uchwała z 31.10.2013r.","BRZEZINY",1021011,1,null,500,9.6,"([2.1.1]+[2.1.3.1] + [5.1]+[9.5]-[5.1.1]- [2.1.1.1] )/[1]"," Wskaźnik planowanej łącznej kwoty spłaty zobowiązań, o której mowa w art. 243 ust. 1 ustawy do dochodów ogółem, po uwzględnieniu zobowiązań związku współtworzonego przez jednostkę samorządu terytorialnego oraz po uwzględnieniu wyłączeń przypadających na dany rok określonych w pkt 5.1.1.",false,4,2017,7.6899999999999996E-2,"2013-10-31","2013-10-31"]
[2013,"Uchwała z 31.10.2013r.","BRZEZINY",1021011,1,null,500,9.6,"([2.1.1]+[2.1.3.1] + [5.1]+[9.5]-[5.1.1]- [2.1.1.1] )/[1]"," Wskaźnik planowanej łącznej kwoty spłaty zobowiązań, o której mowa w art. 243 ust. 1 ustawy do dochodów ogółem, po uwzględnieniu zobowiązań związku współtworzonego przez jednostkę samorządu terytorialnego oraz po uwzględnieniu wyłączeń przypadających na dany rok określonych w pkt 5.1.1.",false,6,2019,6.13E-2,"2013-10-31","2013-10-31"]
[2013,"Uchwała z 31.10.2013r.","BRZEZINY",1021011,1,null,500,9.6,"([2.1.1]+[2.1.3.1] + [5.1]+[9.5]-[5.1.1]- [2.1.1.1] )/[1]"," Wskaźnik planowanej łącznej kwoty spłaty zobowiązań, o której mowa w art. 243 ust. 1 ustawy do dochodów ogółem, po uwzględnieniu zobowiązań związku współtworzonego przez jednostkę samorządu terytorialnego oraz po uwzględnieniu wyłączeń przypadających na dany rok określonych w pkt 5.1.1.",false,9,2022,5.3199999999999997E-2,"2013-10-31","2013-10-31"]
[2013,"Uchwała z 31.10.2013r.","BRZEZINY",1021011,1,null,500,9.6,"([2.1.1]+[2.1.3.1] + [5.1]+[9.5]-[5.1.1]- [2.1.1.1] )/[1]"," Wskaźnik planowanej łącznej kwoty spłaty zobowiązań, o której mowa w art. 243 ust. 1 ustawy do dochodów ogółem, po uwzględnieniu zobowiązań związku współtworzonego przez jednostkę samorządu terytorialnego oraz po uwzględnieniu wyłączeń przypadających na dany rok określonych w pkt 5.1.1.",false,2,2015,5.9799999999999999E-2,"2013-10-31","2013-10-31"]
[2013,"Uchwała z 31.10.2013r.","BRZEZINY",1021011,1,null,500,9.6,"([2.1.1]+[2.1.3.1] + [5.1]+[9.5]-[5.1.1]- [2.1.1.1] )/[1]"," Wskaźnik planowanej łącznej kwoty spłaty zobowiązań, o której mowa w art. 243 ust. 1 ustawy do dochodów ogółem, po uwzględnieniu zobowiązań związku współtworzonego przez jednostkę samorządu terytorialnego oraz po uwzględnieniu wyłączeń przypadających na dany rok określonych w pkt 5.1.1.",false,0,2013,0.14560000000000001,"2013-10-31","2013-10-31"]
[2013,"Uchwała z 31.10.2013r.","BRZEZINY",1021011,1,null,500,9.6,"([2.1.1]+[2.1.3.1] + [5.1]+[9.5]-[5.1.1]- [2.1.1.1] )/[1]"," Wskaźnik planowanej łącznej kwoty spłaty zobowiązań, o której mowa w art. 243 ust. 1 ustawy do dochodów ogółem, po uwzględnieniu zobowiązań związku współtworzonego przez jednostkę samorządu terytorialnego oraz po uwzględnieniu wyłączeń przypadających na dany rok określonych w pkt 5.1.1.",false,8,2021,5.5800000000000002E-2,"2013-10-31","2013-10-31"]
[2013,"Uchwała z 31.10.2013r.","BRZEZINY",1021011,1,null,500,9.6,"([2.1.1]+[2.1.3.1] + [5.1]+[9.5]-[5.1.1]- [2.1.1.1] )/[1]"," Wskaźnik planowanej łącznej kwoty spłaty zobowiązań, o której mowa w art. 243 ust. 1 ustawy do dochodów ogółem, po uwzględnieniu zobowiązań związku współtworzonego przez jednostkę samorządu terytorialnego oraz po uwzględnieniu wyłączeń przypadających na dany rok określonych w pkt 5.1.1.",false,3,2016,6.9199999999999998E-2,"2013-10-31","2013-10-31"]
[2013,"Uchwała z 31.10.2013r.","BRZEZINY",1021011,1,null,500,9.6,"([2.1.1]+[2.1.3.1] + [5.1]+[9.5]-[5.1.1]- [2.1.1.1] )/[1]"," Wskaźnik planowanej łącznej kwoty spłaty zobowiązań, o której mowa w art. 243 ust. 1 ustawy do dochodów ogółem, po uwzględnieniu zobowiązań związku współtworzonego przez jednostkę samorządu terytorialnego oraz po uwzględnieniu wyłączeń przypadających na dany rok określonych w pkt 5.1.1.",false,5,2018,6.6299999999999998E-2,"2013-10-31","2013-10-31"]
[2013,"Uchwała z 31.10.2013r.","BRZEZINY",1021011,1,null,500,9.6,"([2.1.1]+[2.1.3.1] + [5.1]+[9.5]-[5.1.1]- [2.1.1.1] )/[1]"," Wskaźnik planowanej łącznej kwoty spłaty zobowiązań, o której mowa w art. 243 ust. 1 ustawy do dochodów ogółem, po uwzględnieniu zobowiązań związku współtworzonego przez jednostkę samorządu terytorialnego oraz po uwzględnieniu wyłączeń przypadających na dany rok określonych w pkt 5.1.1.",false,1,2014,5.2400000000000002E-2,"2013-10-31","2013-10-31"]
[2013,"Uchwała z 31.10.2013r.","BRZEZINY",1021011,1,null,600,11.3,"[11.3.1] + [11.3.2]"," Wydatki objęte limitem art. 226 ust. 3 ustawy",true,0,2013,3754113.07,"2013-10-31","2013-10-31"]
[2013,"Uchwała z 31.10.2013r.","BRZEZINY",1021011,1,null,500,9.6,"([2.1.1]+[2.1.3.1] + [5.1]+[9.5]-[5.1.1]- [2.1.1.1] )/[1]"," Wskaźnik planowanej łącznej kwoty spłaty zobowiązań, o której mowa w art. 243 ust. 1 ustawy do dochodów ogółem, po uwzględnieniu zobowiązań związku współtworzonego przez jednostkę samorządu terytorialnego oraz po uwzględnieniu wyłączeń przypadających na dany rok określonych w pkt 5.1.1.",false,7,2020,5.8400000000000001E-2,"2013-10-31","2013-10-31"]
[2013,"Uchwała z 31.10.2013r.","BRZEZINY",1021011,1,null,710,"12.2.1",null,"   -  w tym środki określone w art. 5 ust. 1 pkt 2 ustawy",false,0,2013,3052450.3,"2013-10-31","2013-10-31"]
[2013,"Uchwała z 31.10.2013r.","BRZEZINY",1021011,1,null,380,6.2,"[6] / [1]"," Wskaźnik zadłużenia do dochodów ogółem określony w art. 170 ufp z 2005 r., bez uwzględniania wyłączeń określonych w pkt 6.1.   ",false,1,2014,0.46239999999999998,"2013-10-31","2013-10-31"]
[2013,"Uchwała z 31.10.2013r.","BRZEZINY",1021011,1,null,380,6.2,"[6] / [1]"," Wskaźnik zadłużenia do dochodów ogółem określony w art. 170 ufp z 2005 r., bez uwzględniania wyłączeń określonych w pkt 6.1.   ",false,7,2020,0.1484,"2013-10-31","2013-10-31"]
[2013,"Uchwała z 31.10.2013r.","BRZEZINY",1021011,1,null,380,6.2,"[6] / [1]"," Wskaźnik zadłużenia do dochodów ogółem określony w art. 170 ufp z 2005 r., bez uwzględniania wyłączeń określonych w pkt 6.1.   ",false,4,2017,0.30840000000000001,"2013-10-31","2013-10-31"]
[2013,"Uchwała z 31.10.2013r.","BRZEZINY",1021011,1,null,380,6.2,"[6] / [1]"," Wskaźnik zadłużenia do dochodów ogółem określony w art. 170 ufp z 2005 r., bez uwzględniania wyłączeń określonych w pkt 6.1.   ",false,9,2022,4.9599999999999998E-2,"2013-10-31","2013-10-31"]
[2013,"Uchwała z 31.10.2013r.","BRZEZINY",1021011,1,null,380,6.2,"[6] / [1]"," Wskaźnik zadłużenia do dochodów ogółem określony w art. 170 ufp z 2005 r., bez uwzględniania wyłączeń określonych w pkt 6.1.   ",false,0,2013,0.41739999999999999,"2013-10-31","2013-10-31"]
[2013,"Uchwała z 31.10.2013r.","BRZEZINY",1021011,1,null,380,6.2,"[6] / [1]"," Wskaźnik zadłużenia do dochodów ogółem określony w art. 170 ufp z 2005 r., bez uwzględniania wyłączeń określonych w pkt 6.1.   ",false,8,2021,9.8799999999999999E-2,"2013-10-31","2013-10-31"]
[2013,"Uchwała z 31.10.2013r.","BRZEZINY",1021011,1,null,380,6.2,"[6] / [1]"," Wskaźnik zadłużenia do dochodów ogółem określony w art. 170 ufp z 2005 r., bez uwzględniania wyłączeń określonych w pkt 6.1.   ",false,3,2016,0.37409999999999999,"2013-10-31","2013-10-31"]
[2013,"Uchwała z 31.10.2013r.","BRZEZINY",1021011,1,null,380,6.2,"[6] / [1]"," Wskaźnik zadłużenia do dochodów ogółem określony w art. 170 ufp z 2005 r., bez uwzględniania wyłączeń określonych w pkt 6.1.   ",false,6,2019,0.19939999999999999,"2013-10-31","2013-10-31"]
[2013,"Uchwała z 31.10.2013r.","BRZEZINY",1021011,1,null,380,6.2,"[6] / [1]"," Wskaźnik zadłużenia do dochodów ogółem określony w art. 170 ufp z 2005 r., bez uwzględniania wyłączeń określonych w pkt 6.1.   ",false,2,2015,0.42380000000000001,"2013-10-31","2013-10-31"]
[2013,"Uchwała z 31.10.2013r.","BRZEZINY",1021011,1,null,380,6.2,"[6] / [1]"," Wskaźnik zadłużenia do dochodów ogółem określony w art. 170 ufp z 2005 r., bez uwzględniania wyłączeń określonych w pkt 6.1.   ",false,5,2018,0.252,"2013-10-31","2013-10-31"]
[2013,"Uchwała z 31.10.2013r.","BRZEZINY",1021011,1,null,20,1.1000000000000001,null," Dochody bieżące",true,6,2019,33000000,"2013-10-31","2013-10-31"]
[2013,"Uchwała z 31.10.2013r.","BRZEZINY",1021011,1,null,20,1.1000000000000001,null," Dochody bieżące",true,3,2016,31500000,"2013-10-31","2013-10-31"]
[2013,"Uchwała z 31.10.2013r.","BRZEZINY",1021011,1,null,20,1.1000000000000001,null," Dochody bieżące",true,0,2013,32469863.809999999,"2013-10-31","2013-10-31"]
[2013,"Uchwała z 31.10.2013r.","BRZEZINY",1021011,1,null,20,1.1000000000000001,null," Dochody bieżące",true,8,2021,34000000,"2013-10-31","2013-10-31"]
[2013,"Uchwała z 31.10.2013r.","BRZEZINY",1021011,1,null,20,1.1000000000000001,null," Dochody bieżące",true,2,2015,31500000,"2013-10-31","2013-10-31"]
[2013,"Uchwała z 31.10.2013r.","BRZEZINY",1021011,1,null,20,1.1000000000000001,null," Dochody bieżące",true,9,2022,34500000,"2013-10-31","2013-10-31"]
[2013,"Uchwała z 31.10.2013r.","BRZEZINY",1021011,1,null,20,1.1000000000000001,null," Dochody bieżące",true,1,2014,31500000.710000001,"2013-10-31","2013-10-31"]
[2013,"Uchwała z 31.10.2013r.","BRZEZINY",1021011,1,null,20,1.1000000000000001,null," Dochody bieżące",true,5,2018,32500000,"2013-10-31","2013-10-31"]
[2013,"Uchwała z 31.10.2013r.","BRZEZINY",1021011,1,null,20,1.1000000000000001,null," Dochody bieżące",true,4,2017,32000000,"2013-10-31","2013-10-31"]
[2013,"Uchwała z 31.10.2013r.","BRZEZINY",1021011,1,null,20,1.1000000000000001,null," Dochody bieżące",true,7,2020,33500000,"2013-10-31","2013-10-31"]
[2013,"Uchwała z 31.10.2013r.","BRZEZINY",1021011,1,null,20,1.1000000000000001,null," Dochody bieżące",true,10,2023,35000000,"2013-10-31","2013-10-31"]
[2013,"Uchwała z 31.10.2013r.","BRZEZINY",1021011,1,null,770,"12.4.1",null,"  -  w tym finansowane środkami określonymi w art. 5 ust. 1 pkt 2 ustawy",true,0,2013,529995.71,"2013-10-31","2013-10-31"]
[2013,"Uchwała z 31.10.2013r.","BRZEZINY",1021011,1,null,600,11.3,"[11.3.1] + [11.3.2]"," Wydatki objęte limitem art. 226 ust. 3 ustawy",true,5,2018,56,"2013-10-31","2013-10-31"]
[2013,"Uchwała z 31.10.2013r.","BRZEZINY",1021011,1,null,600,11.3,"[11.3.1] + [11.3.2]"," Wydatki objęte limitem art. 226 ust. 3 ustawy",true,4,2017,56,"2013-10-31","2013-10-31"]
[2013,"Uchwała z 31.10.2013r.","BRZEZINY",1021011,1,null,600,11.3,"[11.3.1] + [11.3.2]"," Wydatki objęte limitem art. 226 ust. 3 ustawy",true,6,2019,56,"2013-10-31","2013-10-31"]
[2013,"Uchwała z 31.10.2013r.","BRZEZINY",1021011,1,null,600,11.3,"[11.3.1] + [11.3.2]"," Wydatki objęte limitem art. 226 ust. 3 ustawy",true,3,2016,56,"2013-10-31","2013-10-31"]
[2013,"Uchwała z 31.10.2013r.","BRZEZINY",1021011,1,null,600,11.3,"[11.3.1] + [11.3.2]"," Wydatki objęte limitem art. 226 ust. 3 ustawy",true,7,2020,20,"2013-10-31","2013-10-31"]
[2013,"Uchwała z 31.10.2013r.","BRZEZINY",1021011,1,null,600,11.3,"[11.3.1] + [11.3.2]"," Wydatki objęte limitem art. 226 ust. 3 ustawy",true,2,2015,449902.82,"2013-10-31","2013-10-31"]
[2013,"Uchwała z 31.10.2013r.","BRZEZINY",1021011,1,null,10,1,"[1.1] + [1.2]","Dochody ogółem",true,7,2020,33500000,"2013-10-31","2013-10-31"]
[2013,"Uchwała z 31.10.2013r.","BRZEZINY",1021011,1,null,10,1,"[1.1] + [1.2]","Dochody ogółem",true,3,2016,31500000,"2013-10-31","2013-10-31"]
[2013,"Uchwała z 31.10.2013r.","BRZEZINY",1021011,1,null,10,1,"[1.1] + [1.2]","Dochody ogółem",true,4,2017,32000000,"2013-10-31","2013-10-31"]
[2013,"Uchwała z 31.10.2013r.","BRZEZINY",1021011,1,null,10,1,"[1.1] + [1.2]","Dochody ogółem",true,2,2015,31500000,"2013-10-31","2013-10-31"]
[2013,"Uchwała z 31.10.2013r.","BRZEZINY",1021011,1,null,10,1,"[1.1] + [1.2]","Dochody ogółem",true,10,2023,35000000,"2013-10-31","2013-10-31"]
[2013,"Uchwała z 31.10.2013r.","BRZEZINY",1021011,1,null,10,1,"[1.1] + [1.2]","Dochody ogółem",true,0,2013,37144207.170000002,"2013-10-31","2013-10-31"]
[2013,"Uchwała z 31.10.2013r.","BRZEZINY",1021011,1,null,10,1,"[1.1] + [1.2]","Dochody ogółem",true,6,2019,33000000,"2013-10-31","2013-10-31"]
[2013,"Uchwała z 31.10.2013r.","BRZEZINY",1021011,1,null,10,1,"[1.1] + [1.2]","Dochody ogółem",true,5,2018,32500000,"2013-10-31","2013-10-31"]
[2013,"Uchwała z 31.10.2013r.","BRZEZINY",1021011,1,null,10,1,"[1.1] + [1.2]","Dochody ogółem",true,1,2014,31500000.710000001,"2013-10-31","2013-10-31"]
[2013,"Uchwała z 31.10.2013r.","BRZEZINY",1021011,1,null,10,1,"[1.1] + [1.2]","Dochody ogółem",true,8,2021,34000000,"2013-10-31","2013-10-31"]
[2013,"Uchwała z 31.10.2013r.","BRZEZINY",1021011,1,null,10,1,"[1.1] + [1.2]","Dochody ogółem",true,9,2022,34500000,"2013-10-31","2013-10-31"]
[2013,"Uchwała z 31.10.2013r.","BRZEZINY",1021011,1,null,590,11.2,null," Wydatki związane z funkcjonowaniem organów jednostki samorządu terytorialnego",true,5,2018,3400000,"2013-10-31","2013-10-31"]
[2013,"Uchwała z 31.10.2013r.","BRZEZINY",1021011,1,null,590,11.2,null," Wydatki związane z funkcjonowaniem organów jednostki samorządu terytorialnego",true,3,2016,3200000,"2013-10-31","2013-10-31"]
[2013,"Uchwała z 31.10.2013r.","BRZEZINY",1021011,1,null,590,11.2,null," Wydatki związane z funkcjonowaniem organów jednostki samorządu terytorialnego",true,10,2023,3900000,"2013-10-31","2013-10-31"]
[2013,"Uchwała z 31.10.2013r.","BRZEZINY",1021011,1,null,590,11.2,null," Wydatki związane z funkcjonowaniem organów jednostki samorządu terytorialnego",true,4,2017,3300000,"2013-10-31","2013-10-31"]
[2013,"Uchwała z 31.10.2013r.","BRZEZINY",1021011,1,null,590,11.2,null," Wydatki związane z funkcjonowaniem organów jednostki samorządu terytorialnego",true,9,2022,3800000,"2013-10-31","2013-10-31"]
[2013,"Uchwała z 31.10.2013r.","BRZEZINY",1021011,1,null,590,11.2,null," Wydatki związane z funkcjonowaniem organów jednostki samorządu terytorialnego",true,6,2019,3500000,"2013-10-31","2013-10-31"]
[2013,"Uchwała z 31.10.2013r.","BRZEZINY",1021011,1,null,590,11.2,null," Wydatki związane z funkcjonowaniem organów jednostki samorządu terytorialnego",true,2,2015,3100000,"2013-10-31","2013-10-31"]
[2013,"Uchwała z 31.10.2013r.","BRZEZINY",1021011,1,null,590,11.2,null," Wydatki związane z funkcjonowaniem organów jednostki samorządu terytorialnego",true,0,2013,3136825.95,"2013-10-31","2013-10-31"]
[2013,"Uchwała z 31.10.2013r.","BRZEZINY",1021011,1,null,590,11.2,null," Wydatki związane z funkcjonowaniem organów jednostki samorządu terytorialnego",true,8,2021,3700000,"2013-10-31","2013-10-31"]
[2013,"Uchwała z 31.10.2013r.","BRZEZINY",1021011,1,null,590,11.2,null," Wydatki związane z funkcjonowaniem organów jednostki samorządu terytorialnego",true,7,2020,3600000,"2013-10-31","2013-10-31"]
[2013,"Uchwała z 31.10.2013r.","BRZEZINY",1021011,1,null,590,11.2,null," Wydatki związane z funkcjonowaniem organów jednostki samorządu terytorialnego",true,1,2014,3000000,"2013-10-31","2013-10-31"]
[2013,"Uchwała z 31.10.2013r.","BRZEZINY",1021011,1,null,580,11.1,null," Wydatki bieżące na wynagrodzenia i składki od nich naliczane",false,6,2019,13600000,"2013-10-31","2013-10-31"]
[2013,"Uchwała z 31.10.2013r.","BRZEZINY",1021011,1,null,580,11.1,null," Wydatki bieżące na wynagrodzenia i składki od nich naliczane",false,4,2017,13200000,"2013-10-31","2013-10-31"]
[2013,"Uchwała z 31.10.2013r.","BRZEZINY",1021011,1,null,580,11.1,null," Wydatki bieżące na wynagrodzenia i składki od nich naliczane",false,0,2013,12581224,"2013-10-31","2013-10-31"]
[2013,"Uchwała z 31.10.2013r.","BRZEZINY",1021011,1,null,580,11.1,null," Wydatki bieżące na wynagrodzenia i składki od nich naliczane",false,7,2020,13800000,"2013-10-31","2013-10-31"]
[2013,"Uchwała z 31.10.2013r.","BRZEZINY",1021011,1,null,580,11.1,null," Wydatki bieżące na wynagrodzenia i składki od nich naliczane",false,10,2023,14500000,"2013-10-31","2013-10-31"]
[2013,"Uchwała z 31.10.2013r.","BRZEZINY",1021011,1,null,580,11.1,null," Wydatki bieżące na wynagrodzenia i składki od nich naliczane",false,2,2015,12800000,"2013-10-31","2013-10-31"]
[2013,"Uchwała z 31.10.2013r.","BRZEZINY",1021011,1,null,580,11.1,null," Wydatki bieżące na wynagrodzenia i składki od nich naliczane",false,3,2016,13000000,"2013-10-31","2013-10-31"]
[2013,"Uchwała z 31.10.2013r.","BRZEZINY",1021011,1,null,580,11.1,null," Wydatki bieżące na wynagrodzenia i składki od nich naliczane",false,5,2018,13400000,"2013-10-31","2013-10-31"]
[2013,"Uchwała z 31.10.2013r.","BRZEZINY",1021011,1,null,580,11.1,null," Wydatki bieżące na wynagrodzenia i składki od nich naliczane",false,1,2014,12400000,"2013-10-31","2013-10-31"]
[2013,"Uchwała z 31.10.2013r.","BRZEZINY",1021011,1,null,580,11.1,null," Wydatki bieżące na wynagrodzenia i składki od nich naliczane",false,8,2021,14000000,"2013-10-31","2013-10-31"]
[2013,"Uchwała z 31.10.2013r.","BRZEZINY",1021011,1,null,580,11.1,null," Wydatki bieżące na wynagrodzenia i składki od nich naliczane",false,9,2022,14251000,"2013-10-31","2013-10-31"]
[2013,"Uchwała z 31.10.2013r.","BRZEZINY",1021011,1,null,170,"2.1.3",null,"  wydatki na obsługę długu",true,1,2014,602000,"2013-10-31","2013-10-31"]
[2013,"Uchwała z 31.10.2013r.","BRZEZINY",1021011,1,null,170,"2.1.3",null,"  wydatki na obsługę długu",true,10,2023,69000,"2013-10-31","2013-10-31"]
[2013,"Uchwała z 31.10.2013r.","BRZEZINY",1021011,1,null,170,"2.1.3",null,"  wydatki na obsługę długu",true,3,2016,503000,"2013-10-31","2013-10-31"]
[2013,"Uchwała z 31.10.2013r.","BRZEZINY",1021011,1,null,170,"2.1.3",null,"  wydatki na obsługę długu",true,9,2022,128000,"2013-10-31","2013-10-31"]
[2013,"Uchwała z 31.10.2013r.","BRZEZINY",1021011,1,null,170,"2.1.3",null,"  wydatki na obsługę długu",true,4,2017,434000,"2013-10-31","2013-10-31"]
[2013,"Uchwała z 31.10.2013r.","BRZEZINY",1021011,1,null,170,"2.1.3",null,"  wydatki na obsługę długu",true,2,2015,559000,"2013-10-31","2013-10-31"]
[2013,"Uchwała z 31.10.2013r.","BRZEZINY",1021011,1,null,170,"2.1.3",null,"  wydatki na obsługę długu",true,5,2018,366000,"2013-10-31","2013-10-31"]
[2013,"Uchwała z 31.10.2013r.","BRZEZINY",1021011,1,null,170,"2.1.3",null,"  wydatki na obsługę długu",true,6,2019,302000,"2013-10-31","2013-10-31"]
[2013,"Uchwała z 31.10.2013r.","BRZEZINY",1021011,1,null,170,"2.1.3",null,"  wydatki na obsługę długu",true,0,2013,700000,"2013-10-31","2013-10-31"]
[2013,"Uchwała z 31.10.2013r.","BRZEZINY",1021011,1,null,170,"2.1.3",null,"  wydatki na obsługę długu",true,7,2020,237000,"2013-10-31","2013-10-31"]
[2013,"Uchwała z 31.10.2013r.","BRZEZINY",1021011,1,null,170,"2.1.3",null,"  wydatki na obsługę długu",true,8,2021,185000,"2013-10-31","2013-10-31"]
[2013,"Uchwała z 31.10.2013r.","BRZEZINY",1021011,1,null,730,12.3,null," Wydatki bieżące na programy, projekty lub zadania finansowane z udziałem środków, o których mowa w art. 5 ust. 1 pkt 2 i 3 ustawy",false,0,2013,1974899.23,"2013-10-31","2013-10-31"]
[2013,"Uchwała z 31.10.2013r.","BRZEZINY",1021011,1,null,730,12.3,null," Wydatki bieżące na programy, projekty lub zadania finansowane z udziałem środków, o których mowa w art. 5 ust. 1 pkt 2 i 3 ustawy",false,1,2014,262135.15,"2013-10-31","2013-10-31"]
[2013,"Uchwała z 31.10.2013r.","BRZEZINY",1021011,1,null,880,14.1,null," Spłaty rat kapitałowych oraz wykup papierów wartościowych, o których mowa w pkt. 5.1., wynikające wyłącznie z tytułu zobowiązań już zaciągniętych",true,6,2019,1310004,"2013-10-31","2013-10-31"]
[2013,"Uchwała z 31.10.2013r.","BRZEZINY",1021011,1,null,880,14.1,null," Spłaty rat kapitałowych oraz wykup papierów wartościowych, o których mowa w pkt. 5.1., wynikające wyłącznie z tytułu zobowiązań już zaciągniętych",true,1,2014,938060.16,"2013-10-31","2013-10-31"]
[2013,"Uchwała z 31.10.2013r.","BRZEZINY",1021011,1,null,880,14.1,null," Spłaty rat kapitałowych oraz wykup papierów wartościowych, o których mowa w pkt. 5.1., wynikające wyłącznie z tytułu zobowiązań już zaciągniętych",true,3,2016,1565696,"2013-10-31","2013-10-31"]
[2013,"Uchwała z 31.10.2013r.","BRZEZINY",1021011,1,null,880,14.1,null," Spłaty rat kapitałowych oraz wykup papierów wartościowych, o których mowa w pkt. 5.1., wynikające wyłącznie z tytułu zobowiązań już zaciągniętych",true,2,2015,1215692,"2013-10-31","2013-10-31"]
[2013,"Uchwała z 31.10.2013r.","BRZEZINY",1021011,1,null,880,14.1,null," Spłaty rat kapitałowych oraz wykup papierów wartościowych, o których mowa w pkt. 5.1., wynikające wyłącznie z tytułu zobowiązań już zaciągniętych",true,0,2013,4710000,"2013-10-31","2013-10-31"]
[2013,"Uchwała z 31.10.2013r.","BRZEZINY",1021011,1,null,880,14.1,null," Spłaty rat kapitałowych oraz wykup papierów wartościowych, o których mowa w pkt. 5.1., wynikające wyłącznie z tytułu zobowiązań już zaciągniętych",true,5,2018,1478204,"2013-10-31","2013-10-31"]
[2013,"Uchwała z 31.10.2013r.","BRZEZINY",1021011,1,null,880,14.1,null," Spłaty rat kapitałowych oraz wykup papierów wartościowych, o których mowa w pkt. 5.1., wynikające wyłącznie z tytułu zobowiązań już zaciągniętych",true,9,2022,350004,"2013-10-31","2013-10-31"]
[2013,"Uchwała z 31.10.2013r.","BRZEZINY",1021011,1,null,880,14.1,null," Spłaty rat kapitałowych oraz wykup papierów wartościowych, o których mowa w pkt. 5.1., wynikające wyłącznie z tytułu zobowiązań już zaciągniętych",true,4,2017,1915700,"2013-10-31","2013-10-31"]
[2013,"Uchwała z 31.10.2013r.","BRZEZINY",1021011,1,null,880,14.1,null," Spłaty rat kapitałowych oraz wykup papierów wartościowych, o których mowa w pkt. 5.1., wynikające wyłącznie z tytułu zobowiązań już zaciągniętych",true,8,2021,710004,"2013-10-31","2013-10-31"]
[2013,"Uchwała z 31.10.2013r.","BRZEZINY",1021011,1,null,880,14.1,null," Spłaty rat kapitałowych oraz wykup papierów wartościowych, o których mowa w pkt. 5.1., wynikające wyłącznie z tytułu zobowiązań już zaciągniętych",true,7,2020,1310004,"2013-10-31","2013-10-31"]
[2013,"Uchwała z 31.10.2013r.","BRZEZINY",1021011,1,null,110,"1.2.2",null,"  z tytułu dotacji oraz środków przeznaczonych na inwestycje",true,0,2013,4381623.3600000003,"2013-10-31","2013-10-31"]
[2013,"Uchwała z 31.10.2013r.","BRZEZINY",1021011,1,null,80,"1.1.5",null,"  z tytułu dotacji i środków przeznaczonych na cele bieżące",true,9,2022,6800000,"2013-10-31","2013-10-31"]
[2013,"Uchwała z 31.10.2013r.","BRZEZINY",1021011,1,null,80,"1.1.5",null,"  z tytułu dotacji i środków przeznaczonych na cele bieżące",true,6,2019,6500000,"2013-10-31","2013-10-31"]
[2013,"Uchwała z 31.10.2013r.","BRZEZINY",1021011,1,null,80,"1.1.5",null,"  z tytułu dotacji i środków przeznaczonych na cele bieżące",true,7,2020,6600000,"2013-10-31","2013-10-31"]
[2013,"Uchwała z 31.10.2013r.","BRZEZINY",1021011,1,null,80,"1.1.5",null,"  z tytułu dotacji i środków przeznaczonych na cele bieżące",true,1,2014,6000000,"2013-10-31","2013-10-31"]
[2013,"Uchwała z 31.10.2013r.","BRZEZINY",1021011,1,null,80,"1.1.5",null,"  z tytułu dotacji i środków przeznaczonych na cele bieżące",true,5,2018,6400000,"2013-10-31","2013-10-31"]
[2013,"Uchwała z 31.10.2013r.","BRZEZINY",1021011,1,null,80,"1.1.5",null,"  z tytułu dotacji i środków przeznaczonych na cele bieżące",true,8,2021,6700000,"2013-10-31","2013-10-31"]
[2013,"Uchwała z 31.10.2013r.","BRZEZINY",1021011,1,null,80,"1.1.5",null,"  z tytułu dotacji i środków przeznaczonych na cele bieżące",true,10,2023,6900000,"2013-10-31","2013-10-31"]
[2013,"Uchwała z 31.10.2013r.","BRZEZINY",1021011,1,null,80,"1.1.5",null,"  z tytułu dotacji i środków przeznaczonych na cele bieżące",true,3,2016,6200000,"2013-10-31","2013-10-31"]
[2013,"Uchwała z 31.10.2013r.","BRZEZINY",1021011,1,null,80,"1.1.5",null,"  z tytułu dotacji i środków przeznaczonych na cele bieżące",true,4,2017,6300000,"2013-10-31","2013-10-31"]
[2013,"Uchwała z 31.10.2013r.","BRZEZINY",1021011,1,null,80,"1.1.5",null,"  z tytułu dotacji i środków przeznaczonych na cele bieżące",true,0,2013,8401953.5099999998,"2013-10-31","2013-10-31"]
[2013,"Uchwała z 31.10.2013r.","BRZEZINY",1021011,1,null,80,"1.1.5",null,"  z tytułu dotacji i środków przeznaczonych na cele bieżące",true,2,2015,6100000,"2013-10-31","2013-10-31"]
[2013,"Uchwała z 31.10.2013r.","BRZEZINY",1021011,1,null,460,9.1999999999999993,"([2.1.1] + [2.1.3.1] + [5.1] - [5.1.1]- [2.1.1.1] ) / [1]"," Wskaźnik planowanej łącznej kwoty spłaty zobowiązań, o której mowa w art. 169 ust. 1 ufp z 2005 r. do dochodów ogółem, po uwzględnieniu wyłączeń przypadających na dany rok określonych w pkt 5.1.1. ",false,2,2015,5.9799999999999999E-2,"2013-10-31","2013-10-31"]
[2013,"Uchwała z 31.10.2013r.","BRZEZINY",1021011,1,null,460,9.1999999999999993,"([2.1.1] + [2.1.3.1] + [5.1] - [5.1.1]- [2.1.1.1] ) / [1]"," Wskaźnik planowanej łącznej kwoty spłaty zobowiązań, o której mowa w art. 169 ust. 1 ufp z 2005 r. do dochodów ogółem, po uwzględnieniu wyłączeń przypadających na dany rok określonych w pkt 5.1.1. ",false,6,2019,6.13E-2,"2013-10-31","2013-10-31"]
[2013,"Uchwała z 31.10.2013r.","BRZEZINY",1021011,1,null,300,5,"[5.1] + [5.2]","Rozchody budżetu",false,4,2017,1915700,"2013-10-31","2013-10-31"]
[2013,"Uchwała z 31.10.2013r.","BRZEZINY",1021011,1,null,300,5,"[5.1] + [5.2]","Rozchody budżetu",false,8,2021,1610004,"2013-10-31","2013-10-31"]
[2013,"Uchwała z 31.10.2013r.","BRZEZINY",1021011,1,null,460,9.1999999999999993,"([2.1.1] + [2.1.3.1] + [5.1] - [5.1.1]- [2.1.1.1] ) / [1]"," Wskaźnik planowanej łącznej kwoty spłaty zobowiązań, o której mowa w art. 169 ust. 1 ufp z 2005 r. do dochodów ogółem, po uwzględnieniu wyłączeń przypadających na dany rok określonych w pkt 5.1.1. ",false,7,2020,5.8400000000000001E-2,"2013-10-31","2013-10-31"]
[2013,"Uchwała z 31.10.2013r.","BRZEZINY",1021011,1,null,460,9.1999999999999993,"([2.1.1] + [2.1.3.1] + [5.1] - [5.1.1]- [2.1.1.1] ) / [1]"," Wskaźnik planowanej łącznej kwoty spłaty zobowiązań, o której mowa w art. 169 ust. 1 ufp z 2005 r. do dochodów ogółem, po uwzględnieniu wyłączeń przypadających na dany rok określonych w pkt 5.1.1. ",false,3,2016,6.9199999999999998E-2,"2013-10-31","2013-10-31"]
[2013,"Uchwała z 31.10.2013r.","BRZEZINY",1021011,1,null,460,9.1999999999999993,"([2.1.1] + [2.1.3.1] + [5.1] - [5.1.1]- [2.1.1.1] ) / [1]"," Wskaźnik planowanej łącznej kwoty spłaty zobowiązań, o której mowa w art. 169 ust. 1 ufp z 2005 r. do dochodów ogółem, po uwzględnieniu wyłączeń przypadających na dany rok określonych w pkt 5.1.1. ",false,10,2023,5.2499999999999998E-2,"2013-10-31","2013-10-31"]
[2013,"Uchwała z 31.10.2013r.","BRZEZINY",1021011,1,null,460,9.1999999999999993,"([2.1.1] + [2.1.3.1] + [5.1] - [5.1.1]- [2.1.1.1] ) / [1]"," Wskaźnik planowanej łącznej kwoty spłaty zobowiązań, o której mowa w art. 169 ust. 1 ufp z 2005 r. do dochodów ogółem, po uwzględnieniu wyłączeń przypadających na dany rok określonych w pkt 5.1.1. ",false,5,2018,6.6299999999999998E-2,"2013-10-31","2013-10-31"]
[2013,"Uchwała z 31.10.2013r.","BRZEZINY",1021011,1,null,460,9.1999999999999993,"([2.1.1] + [2.1.3.1] + [5.1] - [5.1.1]- [2.1.1.1] ) / [1]"," Wskaźnik planowanej łącznej kwoty spłaty zobowiązań, o której mowa w art. 169 ust. 1 ufp z 2005 r. do dochodów ogółem, po uwzględnieniu wyłączeń przypadających na dany rok określonych w pkt 5.1.1. ",false,0,2013,0.14560000000000001,"2013-10-31","2013-10-31"]
[2013,"Uchwała z 31.10.2013r.","BRZEZINY",1021011,1,null,460,9.1999999999999993,"([2.1.1] + [2.1.3.1] + [5.1] - [5.1.1]- [2.1.1.1] ) / [1]"," Wskaźnik planowanej łącznej kwoty spłaty zobowiązań, o której mowa w art. 169 ust. 1 ufp z 2005 r. do dochodów ogółem, po uwzględnieniu wyłączeń przypadających na dany rok określonych w pkt 5.1.1. ",false,9,2022,5.3199999999999997E-2,"2013-10-31","2013-10-31"]
[2013,"Uchwała z 31.10.2013r.","BRZEZINY",1021011,1,null,460,9.1999999999999993,"([2.1.1] + [2.1.3.1] + [5.1] - [5.1.1]- [2.1.1.1] ) / [1]"," Wskaźnik planowanej łącznej kwoty spłaty zobowiązań, o której mowa w art. 169 ust. 1 ufp z 2005 r. do dochodów ogółem, po uwzględnieniu wyłączeń przypadających na dany rok określonych w pkt 5.1.1. ",false,1,2014,5.2400000000000002E-2,"2013-10-31","2013-10-31"]
[2013,"Uchwała z 31.10.2013r.","BRZEZINY",1021011,1,null,460,9.1999999999999993,"([2.1.1] + [2.1.3.1] + [5.1] - [5.1.1]- [2.1.1.1] ) / [1]"," Wskaźnik planowanej łącznej kwoty spłaty zobowiązań, o której mowa w art. 169 ust. 1 ufp z 2005 r. do dochodów ogółem, po uwzględnieniu wyłączeń przypadających na dany rok określonych w pkt 5.1.1. ",false,8,2021,5.5800000000000002E-2,"2013-10-31","2013-10-31"]
[2013,"Uchwała z 31.10.2013r.","BRZEZINY",1021011,1,null,460,9.1999999999999993,"([2.1.1] + [2.1.3.1] + [5.1] - [5.1.1]- [2.1.1.1] ) / [1]"," Wskaźnik planowanej łącznej kwoty spłaty zobowiązań, o której mowa w art. 169 ust. 1 ufp z 2005 r. do dochodów ogółem, po uwzględnieniu wyłączeń przypadających na dany rok określonych w pkt 5.1.1. ",false,4,2017,7.6899999999999996E-2,"2013-10-31","2013-10-31"]
[2013,"Uchwała z 31.10.2013r.","BRZEZINY",1021011,1,null,300,5,"[5.1] + [5.2]","Rozchody budżetu",false,1,2014,938060.16,"2013-10-31","2013-10-31"]
[2013,"Uchwała z 31.10.2013r.","BRZEZINY",1021011,1,null,300,5,"[5.1] + [5.2]","Rozchody budżetu",false,3,2016,1565696,"2013-10-31","2013-10-31"]
[2013,"Uchwała z 31.10.2013r.","BRZEZINY",1021011,1,null,300,5,"[5.1] + [5.2]","Rozchody budżetu",false,9,2022,1650004,"2013-10-31","2013-10-31"]
[2013,"Uchwała z 31.10.2013r.","BRZEZINY",1021011,1,null,300,5,"[5.1] + [5.2]","Rozchody budżetu",false,0,2013,4710000,"2013-10-31","2013-10-31"]
[2013,"Uchwała z 31.10.2013r.","BRZEZINY",1021011,1,null,300,5,"[5.1] + [5.2]","Rozchody budżetu",false,6,2019,1610004,"2013-10-31","2013-10-31"]
[2013,"Uchwała z 31.10.2013r.","BRZEZINY",1021011,1,null,300,5,"[5.1] + [5.2]","Rozchody budżetu",false,5,2018,1678204,"2013-10-31","2013-10-31"]
[2013,"Uchwała z 31.10.2013r.","BRZEZINY",1021011,1,null,300,5,"[5.1] + [5.2]","Rozchody budżetu",false,7,2020,1610004,"2013-10-31","2013-10-31"]
[2013,"Uchwała z 31.10.2013r.","BRZEZINY",1021011,1,null,300,5,"[5.1] + [5.2]","Rozchody budżetu",false,2,2015,1215692,"2013-10-31","2013-10-31"]
[2013,"Uchwała z 31.10.2013r.","BRZEZINY",1021011,1,null,300,5,"[5.1] + [5.2]","Rozchody budżetu",false,10,2023,1710000,"2013-10-31","2013-10-31"]
[2013,"Uchwała z 31.10.2013r.","BRZEZINY",1021011,1,null,560,10.1,null," Spłaty kredytów, pożyczek i wykup papierów wartościowych",false,10,2023,1710000,"2013-10-31","2013-10-31"]
[2013,"Uchwała z 31.10.2013r.","BRZEZINY",1021011,1,null,560,10.1,null," Spłaty kredytów, pożyczek i wykup papierów wartościowych",false,7,2020,1610004,"2013-10-31","2013-10-31"]
[2013,"Uchwała z 31.10.2013r.","BRZEZINY",1021011,1,null,560,10.1,null," Spłaty kredytów, pożyczek i wykup papierów wartościowych",false,2,2015,1215692,"2013-10-31","2013-10-31"]
[2013,"Uchwała z 31.10.2013r.","BRZEZINY",1021011,1,null,560,10.1,null," Spłaty kredytów, pożyczek i wykup papierów wartościowych",false,6,2019,1610004,"2013-10-31","2013-10-31"]
[2013,"Uchwała z 31.10.2013r.","BRZEZINY",1021011,1,null,560,10.1,null," Spłaty kredytów, pożyczek i wykup papierów wartościowych",false,5,2018,1678204,"2013-10-31","2013-10-31"]
[2013,"Uchwała z 31.10.2013r.","BRZEZINY",1021011,1,null,560,10.1,null," Spłaty kredytów, pożyczek i wykup papierów wartościowych",false,8,2021,1610004,"2013-10-31","2013-10-31"]
[2013,"Uchwała z 31.10.2013r.","BRZEZINY",1021011,1,null,560,10.1,null," Spłaty kredytów, pożyczek i wykup papierów wartościowych",false,3,2016,1565696,"2013-10-31","2013-10-31"]
[2013,"Uchwała z 31.10.2013r.","BRZEZINY",1021011,1,null,560,10.1,null," Spłaty kredytów, pożyczek i wykup papierów wartościowych",false,4,2017,1915700,"2013-10-31","2013-10-31"]
[2013,"Uchwała z 31.10.2013r.","BRZEZINY",1021011,1,null,560,10.1,null," Spłaty kredytów, pożyczek i wykup papierów wartościowych",false,1,2014,938060.16,"2013-10-31","2013-10-31"]
[2013,"Uchwała z 31.10.2013r.","BRZEZINY",1021011,1,null,560,10.1,null," Spłaty kredytów, pożyczek i wykup papierów wartościowych",false,9,2022,1650004,"2013-10-31","2013-10-31"]
[2013,"Uchwała z 31.10.2013r.","BRZEZINY",1021011,1,null,700,12.2,null," Dochody majątkowe  na programy, projekty lub zadania finansowane z udziałem środków, o których mowa w art. 5 ust. 1 pkt 2 i 3 ustawy",false,0,2013,3109680.36,"2013-10-31","2013-10-31"]
[2013,"Uchwała z 31.10.2013r.","BRZEZINY",1021011,1,null,630,11.4,null," Wydatki inwestycyjne kontynuowane ",true,0,2013,5060975.58,"2013-10-31","2013-10-31"]
[2013,"Uchwała z 31.10.2013r.","BRZEZINY",1021011,1,null,120,2,"[2.1] + [2.2]","Wydatki ogółem",false,8,2021,32389996,"2013-10-31","2013-10-31"]
[2013,"Uchwała z 31.10.2013r.","BRZEZINY",1021011,1,null,120,2,"[2.1] + [2.2]","Wydatki ogółem",false,7,2020,31889996,"2013-10-31","2013-10-31"]
[2013,"Uchwała z 31.10.2013r.","BRZEZINY",1021011,1,null,120,2,"[2.1] + [2.2]","Wydatki ogółem",false,1,2014,30561940.550000001,"2013-10-31","2013-10-31"]
[2013,"Uchwała z 31.10.2013r.","BRZEZINY",1021011,1,null,120,2,"[2.1] + [2.2]","Wydatki ogółem",false,4,2017,30084300,"2013-10-31","2013-10-31"]
[2013,"Uchwała z 31.10.2013r.","BRZEZINY",1021011,1,null,120,2,"[2.1] + [2.2]","Wydatki ogółem",false,2,2015,30284308,"2013-10-31","2013-10-31"]
[2013,"Uchwała z 31.10.2013r.","BRZEZINY",1021011,1,null,120,2,"[2.1] + [2.2]","Wydatki ogółem",false,10,2023,33290000,"2013-10-31","2013-10-31"]
[2013,"Uchwała z 31.10.2013r.","BRZEZINY",1021011,1,null,120,2,"[2.1] + [2.2]","Wydatki ogółem",false,9,2022,32849996,"2013-10-31","2013-10-31"]
[2013,"Uchwała z 31.10.2013r.","BRZEZINY",1021011,1,null,120,2,"[2.1] + [2.2]","Wydatki ogółem",false,0,2013,39751618.390000001,"2013-10-31","2013-10-31"]
[2013,"Uchwała z 31.10.2013r.","BRZEZINY",1021011,1,null,120,2,"[2.1] + [2.2]","Wydatki ogółem",false,5,2018,30821796,"2013-10-31","2013-10-31"]
[2013,"Uchwała z 31.10.2013r.","BRZEZINY",1021011,1,null,120,2,"[2.1] + [2.2]","Wydatki ogółem",false,6,2019,31389996,"2013-10-31","2013-10-31"]
[2013,"Uchwała z 31.10.2013r.","BRZEZINY",1021011,1,null,120,2,"[2.1] + [2.2]","Wydatki ogółem",false,3,2016,29934304,"2013-10-31","2013-10-31"]
[2013,"Uchwała z 31.10.2013r.","BRZEZINY",1021011,1,null,530,9.8000000000000007,"[9.6] - [9.7]"," Informacja o spełnieniu wskaźnika spłaty zobowiązań określonego w art. 243 ustawy, po uwzględnieniu zobowiązań związku współtworzonego przez jednostkę samorządu terytorialnego oraz po uwzględnieniu wyłączeń określonych w pkt 5.1.1., obliczonego w oparciu o plan 3 kwartałów roku poprzedzającego rok budżetowy",false,2,2015,78,"2013-10-31","2013-10-31"]
[2013,"Uchwała z 31.10.2013r.","BRZEZINY",1021011,1,null,530,9.8000000000000007,"[9.6] - [9.7]"," Informacja o spełnieniu wskaźnika spłaty zobowiązań określonego w art. 243 ustawy, po uwzględnieniu zobowiązań związku współtworzonego przez jednostkę samorządu terytorialnego oraz po uwzględnieniu wyłączeń określonych w pkt 5.1.1., obliczonego w oparciu o plan 3 kwartałów roku poprzedzającego rok budżetowy",false,1,2014,-89,"2013-10-31","2013-10-31"]
[2013,"Uchwała z 31.10.2013r.","BRZEZINY",1021011,1,null,350,6,null,"Kwota długu",true,1,2014,14565308,"2013-10-31","2013-10-31"]
[2013,"Uchwała z 31.10.2013r.","BRZEZINY",1021011,1,null,350,6,null,"Kwota długu",true,6,2019,6580012,"2013-10-31","2013-10-31"]
[2013,"Uchwała z 31.10.2013r.","BRZEZINY",1021011,1,null,350,6,null,"Kwota długu",true,0,2013,15503368.16,"2013-10-31","2013-10-31"]
[2013,"Uchwała z 31.10.2013r.","BRZEZINY",1021011,1,null,530,9.8000000000000007,"[9.6] - [9.7]"," Informacja o spełnieniu wskaźnika spłaty zobowiązań określonego w art. 243 ustawy, po uwzględnieniu zobowiązań związku współtworzonego przez jednostkę samorządu terytorialnego oraz po uwzględnieniu wyłączeń określonych w pkt 5.1.1., obliczonego w oparciu o plan 3 kwartałów roku poprzedzającego rok budżetowy",false,10,2023,768,"2013-10-31","2013-10-31"]
[2013,"Uchwała z 31.10.2013r.","BRZEZINY",1021011,1,null,530,9.8000000000000007,"[9.6] - [9.7]"," Informacja o spełnieniu wskaźnika spłaty zobowiązań określonego w art. 243 ustawy, po uwzględnieniu zobowiązań związku współtworzonego przez jednostkę samorządu terytorialnego oraz po uwzględnieniu wyłączeń określonych w pkt 5.1.1., obliczonego w oparciu o plan 3 kwartałów roku poprzedzającego rok budżetowy",false,3,2016,370,"2013-10-31","2013-10-31"]
[2013,"Uchwała z 31.10.2013r.","BRZEZINY",1021011,1,null,530,9.8000000000000007,"[9.6] - [9.7]"," Informacja o spełnieniu wskaźnika spłaty zobowiązań określonego w art. 243 ustawy, po uwzględnieniu zobowiązań związku współtworzonego przez jednostkę samorządu terytorialnego oraz po uwzględnieniu wyłączeń określonych w pkt 5.1.1., obliczonego w oparciu o plan 3 kwartałów roku poprzedzającego rok budżetowy",false,9,2022,769,"2013-10-31","2013-10-31"]
[2013,"Uchwała z 31.10.2013r.","BRZEZINY",1021011,1,null,530,9.8000000000000007,"[9.6] - [9.7]"," Informacja o spełnieniu wskaźnika spłaty zobowiązań określonego w art. 243 ustawy, po uwzględnieniu zobowiązań związku współtworzonego przez jednostkę samorządu terytorialnego oraz po uwzględnieniu wyłączeń określonych w pkt 5.1.1., obliczonego w oparciu o plan 3 kwartałów roku poprzedzającego rok budżetowy",false,4,2017,612,"2013-10-31","2013-10-31"]
[2013,"Uchwała z 31.10.2013r.","BRZEZINY",1021011,1,null,530,9.8000000000000007,"[9.6] - [9.7]"," Informacja o spełnieniu wskaźnika spłaty zobowiązań określonego w art. 243 ustawy, po uwzględnieniu zobowiązań związku współtworzonego przez jednostkę samorządu terytorialnego oraz po uwzględnieniu wyłączeń określonych w pkt 5.1.1., obliczonego w oparciu o plan 3 kwartałów roku poprzedzającego rok budżetowy",false,6,2019,695,"2013-10-31","2013-10-31"]
[2013,"Uchwała z 31.10.2013r.","BRZEZINY",1021011,1,null,530,9.8000000000000007,"[9.6] - [9.7]"," Informacja o spełnieniu wskaźnika spłaty zobowiązań określonego w art. 243 ustawy, po uwzględnieniu zobowiązań związku współtworzonego przez jednostkę samorządu terytorialnego oraz po uwzględnieniu wyłączeń określonych w pkt 5.1.1., obliczonego w oparciu o plan 3 kwartałów roku poprzedzającego rok budżetowy",false,5,2018,668,"2013-10-31","2013-10-31"]
[2013,"Uchwała z 31.10.2013r.","BRZEZINY",1021011,1,null,530,9.8000000000000007,"[9.6] - [9.7]"," Informacja o spełnieniu wskaźnika spłaty zobowiązań określonego w art. 243 ustawy, po uwzględnieniu zobowiązań związku współtworzonego przez jednostkę samorządu terytorialnego oraz po uwzględnieniu wyłączeń określonych w pkt 5.1.1., obliczonego w oparciu o plan 3 kwartałów roku poprzedzającego rok budżetowy",false,8,2021,751,"2013-10-31","2013-10-31"]
[2013,"Uchwała z 31.10.2013r.","BRZEZINY",1021011,1,null,530,9.8000000000000007,"[9.6] - [9.7]"," Informacja o spełnieniu wskaźnika spłaty zobowiązań określonego w art. 243 ustawy, po uwzględnieniu zobowiązań związku współtworzonego przez jednostkę samorządu terytorialnego oraz po uwzględnieniu wyłączeń określonych w pkt 5.1.1., obliczonego w oparciu o plan 3 kwartałów roku poprzedzającego rok budżetowy",false,7,2020,730,"2013-10-31","2013-10-31"]
[2013,"Uchwała z 31.10.2013r.","BRZEZINY",1021011,1,null,530,9.8000000000000007,"[9.6] - [9.7]"," Informacja o spełnieniu wskaźnika spłaty zobowiązań określonego w art. 243 ustawy, po uwzględnieniu zobowiązań związku współtworzonego przez jednostkę samorządu terytorialnego oraz po uwzględnieniu wyłączeń określonych w pkt 5.1.1., obliczonego w oparciu o plan 3 kwartałów roku poprzedzającego rok budżetowy",false,0,2013,-919,"2013-10-31","2013-10-31"]
[2013,"Uchwała z 31.10.2013r.","BRZEZINY",1021011,1,null,350,6,null,"Kwota długu",true,2,2015,13349616,"2013-10-31","2013-10-31"]
[2013,"Uchwała z 31.10.2013r.","BRZEZINY",1021011,1,null,350,6,null,"Kwota długu",true,4,2017,9868220,"2013-10-31","2013-10-31"]
[2013,"Uchwała z 31.10.2013r.","BRZEZINY",1021011,1,null,350,6,null,"Kwota długu",true,8,2021,3360004,"2013-10-31","2013-10-31"]
[2013,"Uchwała z 31.10.2013r.","BRZEZINY",1021011,1,null,350,6,null,"Kwota długu",true,7,2020,4970008,"2013-10-31","2013-10-31"]
[2013,"Uchwała z 31.10.2013r.","BRZEZINY",1021011,1,null,350,6,null,"Kwota długu",true,5,2018,8190016,"2013-10-31","2013-10-31"]
[2013,"Uchwała z 31.10.2013r.","BRZEZINY",1021011,1,null,350,6,null,"Kwota długu",true,3,2016,11783920,"2013-10-31","2013-10-31"]
[2013,"Uchwała z 31.10.2013r.","BRZEZINY",1021011,1,null,350,6,null,"Kwota długu",true,9,2022,1710000,"2013-10-31","2013-10-31"]
[2013,"Uchwała z 31.10.2013r.","BRZEZINY",1021011,1,null,210,4,"[4.1] + [4.2] + [4.3] + [4.4]","Przychody budżetu",false,0,2013,7317411.2199999997,"2013-10-31","2013-10-31"]
[2013,"Uchwała z 31.10.2013r.","BRZEZINY",1021011,1,null,60,"1.1.3.1",null,"   z podatku od nieruchomości",true,0,2013,3722743.3,"2013-10-31","2013-10-31"]
[2013,"Uchwała z 31.10.2013r.","BRZEZINY",1021011,1,null,60,"1.1.3.1",null,"   z podatku od nieruchomości",true,4,2017,4500000,"2013-10-31","2013-10-31"]
[2013,"Uchwała z 31.10.2013r.","BRZEZINY",1021011,1,null,60,"1.1.3.1",null,"   z podatku od nieruchomości",true,3,2016,4300000,"2013-10-31","2013-10-31"]
[2013,"Uchwała z 31.10.2013r.","BRZEZINY",1021011,1,null,60,"1.1.3.1",null,"   z podatku od nieruchomości",true,8,2021,5300000,"2013-10-31","2013-10-31"]
[2013,"Uchwała z 31.10.2013r.","BRZEZINY",1021011,1,null,60,"1.1.3.1",null,"   z podatku od nieruchomości",true,10,2023,5700000,"2013-10-31","2013-10-31"]
[2013,"Uchwała z 31.10.2013r.","BRZEZINY",1021011,1,null,60,"1.1.3.1",null,"   z podatku od nieruchomości",true,9,2022,5500000,"2013-10-31","2013-10-31"]
[2013,"Uchwała z 31.10.2013r.","BRZEZINY",1021011,1,null,60,"1.1.3.1",null,"   z podatku od nieruchomości",true,6,2019,4900000,"2013-10-31","2013-10-31"]
[2013,"Uchwała z 31.10.2013r.","BRZEZINY",1021011,1,null,60,"1.1.3.1",null,"   z podatku od nieruchomości",true,1,2014,3900000,"2013-10-31","2013-10-31"]
[2013,"Uchwała z 31.10.2013r.","BRZEZINY",1021011,1,null,60,"1.1.3.1",null,"   z podatku od nieruchomości",true,7,2020,5100000,"2013-10-31","2013-10-31"]
[2013,"Uchwała z 31.10.2013r.","BRZEZINY",1021011,1,null,60,"1.1.3.1",null,"   z podatku od nieruchomości",true,5,2018,4700000,"2013-10-31","2013-10-31"]
[2013,"Uchwała z 31.10.2013r.","BRZEZINY",1021011,1,null,60,"1.1.3.1",null,"   z podatku od nieruchomości",true,2,2015,4100000,"2013-10-31","2013-10-31"]
[2013,"Uchwała z 31.10.2013r.","BRZEZINY",1021011,1,null,740,"12.3.1",null,"  -  w tym finansowane środkami określonymi w art. 5 ust. 1 pkt 2 ustawy ",false,1,2014,222594.71,"2013-10-31","2013-10-31"]
[2013,"Uchwała z 31.10.2013r.","BRZEZINY",1021011,1,null,740,"12.3.1",null,"  -  w tym finansowane środkami określonymi w art. 5 ust. 1 pkt 2 ustawy ",false,0,2013,1681470,"2013-10-31","2013-10-31"]
[2013,"Uchwała z 31.10.2013r.","BRZEZINY",1021011,1,null,470,9.3000000000000007,"([2.1.1] + [2.1.3.1] + [5.1] ) / [1]"," Wskaźnik planowanej łącznej kwoty spłaty zobowiązań, o której mowa w art. 243 ust. 1 ustawy do dochodów ogółem, bez uwzględnienia zobowiązań związku współtworzonego przez jednostkę samorządu terytorialnego  i bez uwzględniania wyłączeń przypadających na dany rok określonych w pkt 5.1.1.",true,10,2023,5.2499999999999998E-2,"2013-10-31","2013-10-31"]
[2013,"Uchwała z 31.10.2013r.","BRZEZINY",1021011,1,null,470,9.3000000000000007,"([2.1.1] + [2.1.3.1] + [5.1] ) / [1]"," Wskaźnik planowanej łącznej kwoty spłaty zobowiązań, o której mowa w art. 243 ust. 1 ustawy do dochodów ogółem, bez uwzględnienia zobowiązań związku współtworzonego przez jednostkę samorządu terytorialnego  i bez uwzględniania wyłączeń przypadających na dany rok określonych w pkt 5.1.1.",true,0,2013,0.14560000000000001,"2013-10-31","2013-10-31"]
[2013,"Uchwała z 31.10.2013r.","BRZEZINY",1021011,1,null,470,9.3000000000000007,"([2.1.1] + [2.1.3.1] + [5.1] ) / [1]"," Wskaźnik planowanej łącznej kwoty spłaty zobowiązań, o której mowa w art. 243 ust. 1 ustawy do dochodów ogółem, bez uwzględnienia zobowiązań związku współtworzonego przez jednostkę samorządu terytorialnego  i bez uwzględniania wyłączeń przypadających na dany rok określonych w pkt 5.1.1.",true,8,2021,5.5800000000000002E-2,"2013-10-31","2013-10-31"]
[2013,"Uchwała z 31.10.2013r.","BRZEZINY",1021011,1,null,470,9.3000000000000007,"([2.1.1] + [2.1.3.1] + [5.1] ) / [1]"," Wskaźnik planowanej łącznej kwoty spłaty zobowiązań, o której mowa w art. 243 ust. 1 ustawy do dochodów ogółem, bez uwzględnienia zobowiązań związku współtworzonego przez jednostkę samorządu terytorialnego  i bez uwzględniania wyłączeń przypadających na dany rok określonych w pkt 5.1.1.",true,3,2016,6.9199999999999998E-2,"2013-10-31","2013-10-31"]
[2013,"Uchwała z 31.10.2013r.","BRZEZINY",1021011,1,null,470,9.3000000000000007,"([2.1.1] + [2.1.3.1] + [5.1] ) / [1]"," Wskaźnik planowanej łącznej kwoty spłaty zobowiązań, o której mowa w art. 243 ust. 1 ustawy do dochodów ogółem, bez uwzględnienia zobowiązań związku współtworzonego przez jednostkę samorządu terytorialnego  i bez uwzględniania wyłączeń przypadających na dany rok określonych w pkt 5.1.1.",true,4,2017,7.6899999999999996E-2,"2013-10-31","2013-10-31"]
[2013,"Uchwała z 31.10.2013r.","BRZEZINY",1021011,1,null,470,9.3000000000000007,"([2.1.1] + [2.1.3.1] + [5.1] ) / [1]"," Wskaźnik planowanej łącznej kwoty spłaty zobowiązań, o której mowa w art. 243 ust. 1 ustawy do dochodów ogółem, bez uwzględnienia zobowiązań związku współtworzonego przez jednostkę samorządu terytorialnego  i bez uwzględniania wyłączeń przypadających na dany rok określonych w pkt 5.1.1.",true,2,2015,5.9799999999999999E-2,"2013-10-31","2013-10-31"]
[2013,"Uchwała z 31.10.2013r.","BRZEZINY",1021011,1,null,470,9.3000000000000007,"([2.1.1] + [2.1.3.1] + [5.1] ) / [1]"," Wskaźnik planowanej łącznej kwoty spłaty zobowiązań, o której mowa w art. 243 ust. 1 ustawy do dochodów ogółem, bez uwzględnienia zobowiązań związku współtworzonego przez jednostkę samorządu terytorialnego  i bez uwzględniania wyłączeń przypadających na dany rok określonych w pkt 5.1.1.",true,6,2019,6.13E-2,"2013-10-31","2013-10-31"]
[2013,"Uchwała z 31.10.2013r.","BRZEZINY",1021011,1,null,470,9.3000000000000007,"([2.1.1] + [2.1.3.1] + [5.1] ) / [1]"," Wskaźnik planowanej łącznej kwoty spłaty zobowiązań, o której mowa w art. 243 ust. 1 ustawy do dochodów ogółem, bez uwzględnienia zobowiązań związku współtworzonego przez jednostkę samorządu terytorialnego  i bez uwzględniania wyłączeń przypadających na dany rok określonych w pkt 5.1.1.",true,1,2014,5.2400000000000002E-2,"2013-10-31","2013-10-31"]
[2013,"Uchwała z 31.10.2013r.","BRZEZINY",1021011,1,null,470,9.3000000000000007,"([2.1.1] + [2.1.3.1] + [5.1] ) / [1]"," Wskaźnik planowanej łącznej kwoty spłaty zobowiązań, o której mowa w art. 243 ust. 1 ustawy do dochodów ogółem, bez uwzględnienia zobowiązań związku współtworzonego przez jednostkę samorządu terytorialnego  i bez uwzględniania wyłączeń przypadających na dany rok określonych w pkt 5.1.1.",true,5,2018,6.6299999999999998E-2,"2013-10-31","2013-10-31"]
[2013,"Uchwała z 31.10.2013r.","BRZEZINY",1021011,1,null,470,9.3000000000000007,"([2.1.1] + [2.1.3.1] + [5.1] ) / [1]"," Wskaźnik planowanej łącznej kwoty spłaty zobowiązań, o której mowa w art. 243 ust. 1 ustawy do dochodów ogółem, bez uwzględnienia zobowiązań związku współtworzonego przez jednostkę samorządu terytorialnego  i bez uwzględniania wyłączeń przypadających na dany rok określonych w pkt 5.1.1.",true,7,2020,5.8400000000000001E-2,"2013-10-31","2013-10-31"]
[2013,"Uchwała z 31.10.2013r.","BRZEZINY",1021011,1,null,470,9.3000000000000007,"([2.1.1] + [2.1.3.1] + [5.1] ) / [1]"," Wskaźnik planowanej łącznej kwoty spłaty zobowiązań, o której mowa w art. 243 ust. 1 ustawy do dochodów ogółem, bez uwzględnienia zobowiązań związku współtworzonego przez jednostkę samorządu terytorialnego  i bez uwzględniania wyłączeń przypadających na dany rok określonych w pkt 5.1.1.",true,9,2022,5.3199999999999997E-2,"2013-10-31","2013-10-31"]
[2013,"Uchwała z 31.10.2013r.","BRZEZINY",1021011,1,null,620,"11.3.2",null,"   majątkowe",true,0,2013,2431740.56,"2013-10-31","2013-10-31"]
[2013,"Uchwała z 31.10.2013r.","BRZEZINY",1021011,1,null,620,"11.3.2",null,"   majątkowe",true,1,2014,3620690.3,"2013-10-31","2013-10-31"]
[2013,"Uchwała z 31.10.2013r.","BRZEZINY",1021011,1,null,540,"9.8.1","[9.6] - [9.7.1]","  Informacja o spełnieniu wskaźnika spłaty zobowiązań określonego w art. 243 ustawy, po uwzględnieniu zobowiązań związku współtworzonego przez jednostkę samorządu terytorialnego oraz po uwzględnieniu wyłączeń określonych w pkt 5.1.1., obliczonego w oparciu o wykonanie roku poprzedzającego rok budżetowy",false,4,2017,612,"2013-10-31","2013-10-31"]
[2013,"Uchwała z 31.10.2013r.","BRZEZINY",1021011,1,null,540,"9.8.1","[9.6] - [9.7.1]","  Informacja o spełnieniu wskaźnika spłaty zobowiązań określonego w art. 243 ustawy, po uwzględnieniu zobowiązań związku współtworzonego przez jednostkę samorządu terytorialnego oraz po uwzględnieniu wyłączeń określonych w pkt 5.1.1., obliczonego w oparciu o wykonanie roku poprzedzającego rok budżetowy",false,6,2019,695,"2013-10-31","2013-10-31"]
[2013,"Uchwała z 31.10.2013r.","BRZEZINY",1021011,1,null,540,"9.8.1","[9.6] - [9.7.1]","  Informacja o spełnieniu wskaźnika spłaty zobowiązań określonego w art. 243 ustawy, po uwzględnieniu zobowiązań związku współtworzonego przez jednostkę samorządu terytorialnego oraz po uwzględnieniu wyłączeń określonych w pkt 5.1.1., obliczonego w oparciu o wykonanie roku poprzedzającego rok budżetowy",false,5,2018,668,"2013-10-31","2013-10-31"]
[2013,"Uchwała z 31.10.2013r.","BRZEZINY",1021011,1,null,550,10,null,"Przeznaczenie prognozowanej nadwyżki budżetowej,  w tym na:",false,5,2018,1678204,"2013-10-31","2013-10-31"]
[2013,"Uchwała z 31.10.2013r.","BRZEZINY",1021011,1,null,540,"9.8.1","[9.6] - [9.7.1]","  Informacja o spełnieniu wskaźnika spłaty zobowiązań określonego w art. 243 ustawy, po uwzględnieniu zobowiązań związku współtworzonego przez jednostkę samorządu terytorialnego oraz po uwzględnieniu wyłączeń określonych w pkt 5.1.1., obliczonego w oparciu o wykonanie roku poprzedzającego rok budżetowy",false,0,2013,-724,"2013-10-31","2013-10-31"]
[2013,"Uchwała z 31.10.2013r.","BRZEZINY",1021011,1,null,540,"9.8.1","[9.6] - [9.7.1]","  Informacja o spełnieniu wskaźnika spłaty zobowiązań określonego w art. 243 ustawy, po uwzględnieniu zobowiązań związku współtworzonego przez jednostkę samorządu terytorialnego oraz po uwzględnieniu wyłączeń określonych w pkt 5.1.1., obliczonego w oparciu o wykonanie roku poprzedzającego rok budżetowy",false,10,2023,768,"2013-10-31","2013-10-31"]
[2013,"Uchwała z 31.10.2013r.","BRZEZINY",1021011,1,null,540,"9.8.1","[9.6] - [9.7.1]","  Informacja o spełnieniu wskaźnika spłaty zobowiązań określonego w art. 243 ustawy, po uwzględnieniu zobowiązań związku współtworzonego przez jednostkę samorządu terytorialnego oraz po uwzględnieniu wyłączeń określonych w pkt 5.1.1., obliczonego w oparciu o wykonanie roku poprzedzającego rok budżetowy",false,1,2014,106,"2013-10-31","2013-10-31"]
[2013,"Uchwała z 31.10.2013r.","BRZEZINY",1021011,1,null,540,"9.8.1","[9.6] - [9.7.1]","  Informacja o spełnieniu wskaźnika spłaty zobowiązań określonego w art. 243 ustawy, po uwzględnieniu zobowiązań związku współtworzonego przez jednostkę samorządu terytorialnego oraz po uwzględnieniu wyłączeń określonych w pkt 5.1.1., obliczonego w oparciu o wykonanie roku poprzedzającego rok budżetowy",false,7,2020,730,"2013-10-31","2013-10-31"]
[2013,"Uchwała z 31.10.2013r.","BRZEZINY",1021011,1,null,540,"9.8.1","[9.6] - [9.7.1]","  Informacja o spełnieniu wskaźnika spłaty zobowiązań określonego w art. 243 ustawy, po uwzględnieniu zobowiązań związku współtworzonego przez jednostkę samorządu terytorialnego oraz po uwzględnieniu wyłączeń określonych w pkt 5.1.1., obliczonego w oparciu o wykonanie roku poprzedzającego rok budżetowy",false,9,2022,769,"2013-10-31","2013-10-31"]
[2013,"Uchwała z 31.10.2013r.","BRZEZINY",1021011,1,null,540,"9.8.1","[9.6] - [9.7.1]","  Informacja o spełnieniu wskaźnika spłaty zobowiązań określonego w art. 243 ustawy, po uwzględnieniu zobowiązań związku współtworzonego przez jednostkę samorządu terytorialnego oraz po uwzględnieniu wyłączeń określonych w pkt 5.1.1., obliczonego w oparciu o wykonanie roku poprzedzającego rok budżetowy",false,3,2016,370,"2013-10-31","2013-10-31"]
[2013,"Uchwała z 31.10.2013r.","BRZEZINY",1021011,1,null,540,"9.8.1","[9.6] - [9.7.1]","  Informacja o spełnieniu wskaźnika spłaty zobowiązań określonego w art. 243 ustawy, po uwzględnieniu zobowiązań związku współtworzonego przez jednostkę samorządu terytorialnego oraz po uwzględnieniu wyłączeń określonych w pkt 5.1.1., obliczonego w oparciu o wykonanie roku poprzedzającego rok budżetowy",false,8,2021,751,"2013-10-31","2013-10-31"]
[2013,"Uchwała z 31.10.2013r.","BRZEZINY",1021011,1,null,540,"9.8.1","[9.6] - [9.7.1]","  Informacja o spełnieniu wskaźnika spłaty zobowiązań określonego w art. 243 ustawy, po uwzględnieniu zobowiązań związku współtworzonego przez jednostkę samorządu terytorialnego oraz po uwzględnieniu wyłączeń określonych w pkt 5.1.1., obliczonego w oparciu o wykonanie roku poprzedzającego rok budżetowy",false,2,2015,274,"2013-10-31","2013-10-31"]
[2013,"Uchwała z 31.10.2013r.","BRZEZINY",1021011,1,null,240,4.2,null," Wolne środki, o których mowa w art. 217 ust.2 pkt 6 ustawy",false,0,2013,2607411.2200000002,"2013-10-31","2013-10-31"]
[2013,"Uchwała z 31.10.2013r.","BRZEZINY",1021011,1,null,450,9.1,"([2.1.1] + [2.1.3.1] + [5.1] ) / [1]"," Wskaźnik planowanej łącznej kwoty spłaty zobowiązań, o której mowa w art. 169 ust. 1 ufp z 2005 r. do dochodów ogółem, bez uwzględnienia wyłączeń określonych w pkt 5.1.1.  ",true,5,2018,6.6299999999999998E-2,"2013-10-31","2013-10-31"]
[2013,"Uchwała z 31.10.2013r.","BRZEZINY",1021011,1,null,450,9.1,"([2.1.1] + [2.1.3.1] + [5.1] ) / [1]"," Wskaźnik planowanej łącznej kwoty spłaty zobowiązań, o której mowa w art. 169 ust. 1 ufp z 2005 r. do dochodów ogółem, bez uwzględnienia wyłączeń określonych w pkt 5.1.1.  ",true,3,2016,6.9199999999999998E-2,"2013-10-31","2013-10-31"]
[2013,"Uchwała z 31.10.2013r.","BRZEZINY",1021011,1,null,450,9.1,"([2.1.1] + [2.1.3.1] + [5.1] ) / [1]"," Wskaźnik planowanej łącznej kwoty spłaty zobowiązań, o której mowa w art. 169 ust. 1 ufp z 2005 r. do dochodów ogółem, bez uwzględnienia wyłączeń określonych w pkt 5.1.1.  ",true,4,2017,7.6899999999999996E-2,"2013-10-31","2013-10-31"]
[2013,"Uchwała z 31.10.2013r.","BRZEZINY",1021011,1,null,450,9.1,"([2.1.1] + [2.1.3.1] + [5.1] ) / [1]"," Wskaźnik planowanej łącznej kwoty spłaty zobowiązań, o której mowa w art. 169 ust. 1 ufp z 2005 r. do dochodów ogółem, bez uwzględnienia wyłączeń określonych w pkt 5.1.1.  ",true,2,2015,5.9799999999999999E-2,"2013-10-31","2013-10-31"]
[2013,"Uchwała z 31.10.2013r.","BRZEZINY",1021011,1,null,450,9.1,"([2.1.1] + [2.1.3.1] + [5.1] ) / [1]"," Wskaźnik planowanej łącznej kwoty spłaty zobowiązań, o której mowa w art. 169 ust. 1 ufp z 2005 r. do dochodów ogółem, bez uwzględnienia wyłączeń określonych w pkt 5.1.1.  ",true,0,2013,0.14560000000000001,"2013-10-31","2013-10-31"]
[2013,"Uchwała z 31.10.2013r.","BRZEZINY",1021011,1,null,450,9.1,"([2.1.1] + [2.1.3.1] + [5.1] ) / [1]"," Wskaźnik planowanej łącznej kwoty spłaty zobowiązań, o której mowa w art. 169 ust. 1 ufp z 2005 r. do dochodów ogółem, bez uwzględnienia wyłączeń określonych w pkt 5.1.1.  ",true,6,2019,6.13E-2,"2013-10-31","2013-10-31"]
[2013,"Uchwała z 31.10.2013r.","BRZEZINY",1021011,1,null,450,9.1,"([2.1.1] + [2.1.3.1] + [5.1] ) / [1]"," Wskaźnik planowanej łącznej kwoty spłaty zobowiązań, o której mowa w art. 169 ust. 1 ufp z 2005 r. do dochodów ogółem, bez uwzględnienia wyłączeń określonych w pkt 5.1.1.  ",true,7,2020,5.8400000000000001E-2,"2013-10-31","2013-10-31"]
[2013,"Uchwała z 31.10.2013r.","BRZEZINY",1021011,1,null,450,9.1,"([2.1.1] + [2.1.3.1] + [5.1] ) / [1]"," Wskaźnik planowanej łącznej kwoty spłaty zobowiązań, o której mowa w art. 169 ust. 1 ufp z 2005 r. do dochodów ogółem, bez uwzględnienia wyłączeń określonych w pkt 5.1.1.  ",true,9,2022,5.3199999999999997E-2,"2013-10-31","2013-10-31"]
[2013,"Uchwała z 31.10.2013r.","BRZEZINY",1021011,1,null,450,9.1,"([2.1.1] + [2.1.3.1] + [5.1] ) / [1]"," Wskaźnik planowanej łącznej kwoty spłaty zobowiązań, o której mowa w art. 169 ust. 1 ufp z 2005 r. do dochodów ogółem, bez uwzględnienia wyłączeń określonych w pkt 5.1.1.  ",true,1,2014,5.2400000000000002E-2,"2013-10-31","2013-10-31"]
[2013,"Uchwała z 31.10.2013r.","BRZEZINY",1021011,1,null,450,9.1,"([2.1.1] + [2.1.3.1] + [5.1] ) / [1]"," Wskaźnik planowanej łącznej kwoty spłaty zobowiązań, o której mowa w art. 169 ust. 1 ufp z 2005 r. do dochodów ogółem, bez uwzględnienia wyłączeń określonych w pkt 5.1.1.  ",true,10,2023,5.2499999999999998E-2,"2013-10-31","2013-10-31"]
[2013,"Uchwała z 31.10.2013r.","BRZEZINY",1021011,1,null,450,9.1,"([2.1.1] + [2.1.3.1] + [5.1] ) / [1]"," Wskaźnik planowanej łącznej kwoty spłaty zobowiązań, o której mowa w art. 169 ust. 1 ufp z 2005 r. do dochodów ogółem, bez uwzględnienia wyłączeń określonych w pkt 5.1.1.  ",true,8,2021,5.5800000000000002E-2,"2013-10-31","2013-10-31"]
[2013,"Uchwała z 31.10.2013r.","BRZEZINY",1021011,1,null,250,"4.2.1",null,"   w tym na pokrycie deficytu budżetu",false,0,2013,2607411.2200000002,"2013-10-31","2013-10-31"]
[2013,"Uchwała z 31.10.2013r.","BRZEZINY",1021011,1,null,690,"12.1.1.1",null,"   - w tym środki określone w art. 5 ust. 1 pkt 2 ustawy wynikające wyłącznie z  zawartych umów na realizację programu, projektu lub zadania",true,0,2013,1776085.14,"2013-10-31","2013-10-31"]
[2013,"Uchwała z 31.10.2013r.","BRZEZINY",1021011,1,null,690,"12.1.1.1",null,"   - w tym środki określone w art. 5 ust. 1 pkt 2 ustawy wynikające wyłącznie z  zawartych umów na realizację programu, projektu lub zadania",true,1,2014,222594.71,"2013-10-31","2013-10-31"]
[2013,"Uchwała z 31.10.2013r.","BRZEZINY",1021011,1,null,550,10,null,"Przeznaczenie prognozowanej nadwyżki budżetowej,  w tym na:",false,7,2020,1610004,"2013-10-31","2013-10-31"]
[2013,"Uchwała z 31.10.2013r.","BRZEZINY",1021011,1,null,550,10,null,"Przeznaczenie prognozowanej nadwyżki budżetowej,  w tym na:",false,6,2019,1610004,"2013-10-31","2013-10-31"]
[2013,"Uchwała z 31.10.2013r.","BRZEZINY",1021011,1,null,550,10,null,"Przeznaczenie prognozowanej nadwyżki budżetowej,  w tym na:",false,3,2016,1565696,"2013-10-31","2013-10-31"]
[2013,"Uchwała z 31.10.2013r.","BRZEZINY",1021011,1,null,550,10,null,"Przeznaczenie prognozowanej nadwyżki budżetowej,  w tym na:",false,10,2023,1710000,"2013-10-31","2013-10-31"]
[2013,"Uchwała z 31.10.2013r.","BRZEZINY",1021011,1,null,550,10,null,"Przeznaczenie prognozowanej nadwyżki budżetowej,  w tym na:",false,8,2021,1610004,"2013-10-31","2013-10-31"]
[2013,"Uchwała z 31.10.2013r.","BRZEZINY",1021011,1,null,550,10,null,"Przeznaczenie prognozowanej nadwyżki budżetowej,  w tym na:",false,1,2014,938060.16,"2013-10-31","2013-10-31"]
[2013,"Uchwała z 31.10.2013r.","BRZEZINY",1021011,1,null,550,10,null,"Przeznaczenie prognozowanej nadwyżki budżetowej,  w tym na:",false,9,2022,1650004,"2013-10-31","2013-10-31"]
[2013,"Uchwała z 31.10.2013r.","BRZEZINY",1021011,1,null,550,10,null,"Przeznaczenie prognozowanej nadwyżki budżetowej,  w tym na:",false,4,2017,1915700,"2013-10-31","2013-10-31"]
[2013,"Uchwała z 31.10.2013r.","BRZEZINY",1021011,1,null,550,10,null,"Przeznaczenie prognozowanej nadwyżki budżetowej,  w tym na:",false,2,2015,1215692,"2013-10-31","2013-10-31"]
[2013,"Uchwała z 31.10.2013r.","BRZEZINY",1021011,1,null,480,9.4,"([2.1.1] + [2.1.3.1] + [5.1] - [5.1.1]- [2.1.1.1] ) / [1]"," Wskaźnik planowanej łącznej kwoty spłaty zobowiązań, o której mowa w art. 243 ust. 1 ustawy do dochodów ogółem, bez uwzględnienia zobowiązań związku współtworzonego przez jednostkę samorządu terytorialnego, po uwzględnieniu wyłączeń przypadających na dany rok określonych w pkt 5.1.1. ",false,3,2016,6.9199999999999998E-2,"2013-10-31","2013-10-31"]
[2013,"Uchwała z 31.10.2013r.","BRZEZINY",1021011,1,null,480,9.4,"([2.1.1] + [2.1.3.1] + [5.1] - [5.1.1]- [2.1.1.1] ) / [1]"," Wskaźnik planowanej łącznej kwoty spłaty zobowiązań, o której mowa w art. 243 ust. 1 ustawy do dochodów ogółem, bez uwzględnienia zobowiązań związku współtworzonego przez jednostkę samorządu terytorialnego, po uwzględnieniu wyłączeń przypadających na dany rok określonych w pkt 5.1.1. ",false,1,2014,5.2400000000000002E-2,"2013-10-31","2013-10-31"]
[2013,"Uchwała z 31.10.2013r.","BRZEZINY",1021011,1,null,480,9.4,"([2.1.1] + [2.1.3.1] + [5.1] - [5.1.1]- [2.1.1.1] ) / [1]"," Wskaźnik planowanej łącznej kwoty spłaty zobowiązań, o której mowa w art. 243 ust. 1 ustawy do dochodów ogółem, bez uwzględnienia zobowiązań związku współtworzonego przez jednostkę samorządu terytorialnego, po uwzględnieniu wyłączeń przypadających na dany rok określonych w pkt 5.1.1. ",false,5,2018,6.6299999999999998E-2,"2013-10-31","2013-10-31"]
[2013,"Uchwała z 31.10.2013r.","BRZEZINY",1021011,1,null,480,9.4,"([2.1.1] + [2.1.3.1] + [5.1] - [5.1.1]- [2.1.1.1] ) / [1]"," Wskaźnik planowanej łącznej kwoty spłaty zobowiązań, o której mowa w art. 243 ust. 1 ustawy do dochodów ogółem, bez uwzględnienia zobowiązań związku współtworzonego przez jednostkę samorządu terytorialnego, po uwzględnieniu wyłączeń przypadających na dany rok określonych w pkt 5.1.1. ",false,4,2017,7.6899999999999996E-2,"2013-10-31","2013-10-31"]
[2013,"Uchwała z 31.10.2013r.","BRZEZINY",1021011,1,null,480,9.4,"([2.1.1] + [2.1.3.1] + [5.1] - [5.1.1]- [2.1.1.1] ) / [1]"," Wskaźnik planowanej łącznej kwoty spłaty zobowiązań, o której mowa w art. 243 ust. 1 ustawy do dochodów ogółem, bez uwzględnienia zobowiązań związku współtworzonego przez jednostkę samorządu terytorialnego, po uwzględnieniu wyłączeń przypadających na dany rok określonych w pkt 5.1.1. ",false,6,2019,6.13E-2,"2013-10-31","2013-10-31"]
[2013,"Uchwała z 31.10.2013r.","BRZEZINY",1021011,1,null,480,9.4,"([2.1.1] + [2.1.3.1] + [5.1] - [5.1.1]- [2.1.1.1] ) / [1]"," Wskaźnik planowanej łącznej kwoty spłaty zobowiązań, o której mowa w art. 243 ust. 1 ustawy do dochodów ogółem, bez uwzględnienia zobowiązań związku współtworzonego przez jednostkę samorządu terytorialnego, po uwzględnieniu wyłączeń przypadających na dany rok określonych w pkt 5.1.1. ",false,9,2022,5.3199999999999997E-2,"2013-10-31","2013-10-31"]
[2013,"Uchwała z 31.10.2013r.","BRZEZINY",1021011,1,null,480,9.4,"([2.1.1] + [2.1.3.1] + [5.1] - [5.1.1]- [2.1.1.1] ) / [1]"," Wskaźnik planowanej łącznej kwoty spłaty zobowiązań, o której mowa w art. 243 ust. 1 ustawy do dochodów ogółem, bez uwzględnienia zobowiązań związku współtworzonego przez jednostkę samorządu terytorialnego, po uwzględnieniu wyłączeń przypadających na dany rok określonych w pkt 5.1.1. ",false,0,2013,0.14560000000000001,"2013-10-31","2013-10-31"]
[2013,"Uchwała z 31.10.2013r.","BRZEZINY",1021011,1,null,480,9.4,"([2.1.1] + [2.1.3.1] + [5.1] - [5.1.1]- [2.1.1.1] ) / [1]"," Wskaźnik planowanej łącznej kwoty spłaty zobowiązań, o której mowa w art. 243 ust. 1 ustawy do dochodów ogółem, bez uwzględnienia zobowiązań związku współtworzonego przez jednostkę samorządu terytorialnego, po uwzględnieniu wyłączeń przypadających na dany rok określonych w pkt 5.1.1. ",false,7,2020,5.8400000000000001E-2,"2013-10-31","2013-10-31"]
[2013,"Uchwała z 31.10.2013r.","BRZEZINY",1021011,1,null,190,2.2000000000000002,null," Wydatki majątkowe",false,1,2014,3683005.4,"2013-10-31","2013-10-31"]
[2013,"Uchwała z 31.10.2013r.","BRZEZINY",1021011,1,null,190,2.2000000000000002,null," Wydatki majątkowe",false,0,2013,8408716.1400000006,"2013-10-31","2013-10-31"]
[2013,"Uchwała z 31.10.2013r.","BRZEZINY",1021011,1,null,480,9.4,"([2.1.1] + [2.1.3.1] + [5.1] - [5.1.1]- [2.1.1.1] ) / [1]"," Wskaźnik planowanej łącznej kwoty spłaty zobowiązań, o której mowa w art. 243 ust. 1 ustawy do dochodów ogółem, bez uwzględnienia zobowiązań związku współtworzonego przez jednostkę samorządu terytorialnego, po uwzględnieniu wyłączeń przypadających na dany rok określonych w pkt 5.1.1. ",false,10,2023,5.2499999999999998E-2,"2013-10-31","2013-10-31"]
[2013,"Uchwała z 31.10.2013r.","BRZEZINY",1021011,1,null,480,9.4,"([2.1.1] + [2.1.3.1] + [5.1] - [5.1.1]- [2.1.1.1] ) / [1]"," Wskaźnik planowanej łącznej kwoty spłaty zobowiązań, o której mowa w art. 243 ust. 1 ustawy do dochodów ogółem, bez uwzględnienia zobowiązań związku współtworzonego przez jednostkę samorządu terytorialnego, po uwzględnieniu wyłączeń przypadających na dany rok określonych w pkt 5.1.1. ",false,8,2021,5.5800000000000002E-2,"2013-10-31","2013-10-31"]
[2013,"Uchwała z 31.10.2013r.","BRZEZINY",1021011,1,null,480,9.4,"([2.1.1] + [2.1.3.1] + [5.1] - [5.1.1]- [2.1.1.1] ) / [1]"," Wskaźnik planowanej łącznej kwoty spłaty zobowiązań, o której mowa w art. 243 ust. 1 ustawy do dochodów ogółem, bez uwzględnienia zobowiązań związku współtworzonego przez jednostkę samorządu terytorialnego, po uwzględnieniu wyłączeń przypadających na dany rok określonych w pkt 5.1.1. ",false,2,2015,5.9799999999999999E-2,"2013-10-31","2013-10-31"]
[2013,"Uchwała z 31.10.2013r.","BRZEZINY",1021011,1,null,390,6.3,"([6] - [6.1]) / [1]"," Wskaźnik zadłużenia do dochodów ogółem, o którym mowa w art.  170 ufp z 2005 r., po uwzględnieniu wyłączeń określonych w pkt 6.1. ",false,7,2020,0.1484,"2013-10-31","2013-10-31"]
[2013,"Uchwała z 31.10.2013r.","BRZEZINY",1021011,1,null,390,6.3,"([6] - [6.1]) / [1]"," Wskaźnik zadłużenia do dochodów ogółem, o którym mowa w art.  170 ufp z 2005 r., po uwzględnieniu wyłączeń określonych w pkt 6.1. ",false,4,2017,0.30840000000000001,"2013-10-31","2013-10-31"]
[2013,"Uchwała z 31.10.2013r.","BRZEZINY",1021011,1,null,390,6.3,"([6] - [6.1]) / [1]"," Wskaźnik zadłużenia do dochodów ogółem, o którym mowa w art.  170 ufp z 2005 r., po uwzględnieniu wyłączeń określonych w pkt 6.1. ",false,0,2013,0.41739999999999999,"2013-10-31","2013-10-31"]
[2013,"Uchwała z 31.10.2013r.","BRZEZINY",1021011,1,null,390,6.3,"([6] - [6.1]) / [1]"," Wskaźnik zadłużenia do dochodów ogółem, o którym mowa w art.  170 ufp z 2005 r., po uwzględnieniu wyłączeń określonych w pkt 6.1. ",false,9,2022,4.9599999999999998E-2,"2013-10-31","2013-10-31"]
[2013,"Uchwała z 31.10.2013r.","BRZEZINY",1021011,1,null,390,6.3,"([6] - [6.1]) / [1]"," Wskaźnik zadłużenia do dochodów ogółem, o którym mowa w art.  170 ufp z 2005 r., po uwzględnieniu wyłączeń określonych w pkt 6.1. ",false,1,2014,0.46239999999999998,"2013-10-31","2013-10-31"]
[2013,"Uchwała z 31.10.2013r.","BRZEZINY",1021011,1,null,390,6.3,"([6] - [6.1]) / [1]"," Wskaźnik zadłużenia do dochodów ogółem, o którym mowa w art.  170 ufp z 2005 r., po uwzględnieniu wyłączeń określonych w pkt 6.1. ",false,3,2016,0.37409999999999999,"2013-10-31","2013-10-31"]
[2013,"Uchwała z 31.10.2013r.","BRZEZINY",1021011,1,null,390,6.3,"([6] - [6.1]) / [1]"," Wskaźnik zadłużenia do dochodów ogółem, o którym mowa w art.  170 ufp z 2005 r., po uwzględnieniu wyłączeń określonych w pkt 6.1. ",false,5,2018,0.252,"2013-10-31","2013-10-31"]
[2013,"Uchwała z 31.10.2013r.","BRZEZINY",1021011,1,null,390,6.3,"([6] - [6.1]) / [1]"," Wskaźnik zadłużenia do dochodów ogółem, o którym mowa w art.  170 ufp z 2005 r., po uwzględnieniu wyłączeń określonych w pkt 6.1. ",false,6,2019,0.19939999999999999,"2013-10-31","2013-10-31"]
[2013,"Uchwała z 31.10.2013r.","BRZEZINY",1021011,1,null,390,6.3,"([6] - [6.1]) / [1]"," Wskaźnik zadłużenia do dochodów ogółem, o którym mowa w art.  170 ufp z 2005 r., po uwzględnieniu wyłączeń określonych w pkt 6.1. ",false,8,2021,9.8799999999999999E-2,"2013-10-31","2013-10-31"]
[2013,"Uchwała z 31.10.2013r.","BRZEZINY",1021011,1,null,390,6.3,"([6] - [6.1]) / [1]"," Wskaźnik zadłużenia do dochodów ogółem, o którym mowa w art.  170 ufp z 2005 r., po uwzględnieniu wyłączeń określonych w pkt 6.1. ",false,2,2015,0.42380000000000001,"2013-10-31","2013-10-31"]
[2013,"Uchwała z 31.10.2013r.","BRZEZINY",1021011,1,null,520,"9.7.1",null,"   Dopuszczalny wskaźnik spłaty zobowiązań określony w art. 243 ustawy, po uwzględnieniu wyłączeń określonych w art.  36 ustawy z dnia 7 grudnia 2012 r. o zmianie niektórych ustaw w związku z realizacją ustawy budżetowej, obliczony w oparciu o wykonanie roku poprzedzającego rok budżetowy",true,8,2021,0.13089999999999999,"2013-10-31","2013-10-31"]
[2013,"Uchwała z 31.10.2013r.","BRZEZINY",1021011,1,null,520,"9.7.1",null,"   Dopuszczalny wskaźnik spłaty zobowiązań określony w art. 243 ustawy, po uwzględnieniu wyłączeń określonych w art.  36 ustawy z dnia 7 grudnia 2012 r. o zmianie niektórych ustaw w związku z realizacją ustawy budżetowej, obliczony w oparciu o wykonanie roku poprzedzającego rok budżetowy",true,1,2014,6.3E-2,"2013-10-31","2013-10-31"]
[2013,"Uchwała z 31.10.2013r.","BRZEZINY",1021011,1,null,520,"9.7.1",null,"   Dopuszczalny wskaźnik spłaty zobowiązań określony w art. 243 ustawy, po uwzględnieniu wyłączeń określonych w art.  36 ustawy z dnia 7 grudnia 2012 r. o zmianie niektórych ustaw w związku z realizacją ustawy budżetowej, obliczony w oparciu o wykonanie roku poprzedzającego rok budżetowy",true,6,2019,0.1308,"2013-10-31","2013-10-31"]
[2013,"Uchwała z 31.10.2013r.","BRZEZINY",1021011,1,null,520,"9.7.1",null,"   Dopuszczalny wskaźnik spłaty zobowiązań określony w art. 243 ustawy, po uwzględnieniu wyłączeń określonych w art.  36 ustawy z dnia 7 grudnia 2012 r. o zmianie niektórych ustaw w związku z realizacją ustawy budżetowej, obliczony w oparciu o wykonanie roku poprzedzającego rok budżetowy",true,10,2023,0.1293,"2013-10-31","2013-10-31"]
[2013,"Uchwała z 31.10.2013r.","BRZEZINY",1021011,1,null,520,"9.7.1",null,"   Dopuszczalny wskaźnik spłaty zobowiązań określony w art. 243 ustawy, po uwzględnieniu wyłączeń określonych w art.  36 ustawy z dnia 7 grudnia 2012 r. o zmianie niektórych ustaw w związku z realizacją ustawy budżetowej, obliczony w oparciu o wykonanie roku poprzedzającego rok budżetowy",true,7,2020,0.13139999999999999,"2013-10-31","2013-10-31"]
[2013,"Uchwała z 31.10.2013r.","BRZEZINY",1021011,1,null,520,"9.7.1",null,"   Dopuszczalny wskaźnik spłaty zobowiązań określony w art. 243 ustawy, po uwzględnieniu wyłączeń określonych w art.  36 ustawy z dnia 7 grudnia 2012 r. o zmianie niektórych ustaw w związku z realizacją ustawy budżetowej, obliczony w oparciu o wykonanie roku poprzedzającego rok budżetowy",true,2,2015,8.72E-2,"2013-10-31","2013-10-31"]
[2013,"Uchwała z 31.10.2013r.","BRZEZINY",1021011,1,null,520,"9.7.1",null,"   Dopuszczalny wskaźnik spłaty zobowiązań określony w art. 243 ustawy, po uwzględnieniu wyłączeń określonych w art.  36 ustawy z dnia 7 grudnia 2012 r. o zmianie niektórych ustaw w związku z realizacją ustawy budżetowej, obliczony w oparciu o wykonanie roku poprzedzającego rok budżetowy",true,4,2017,0.1381,"2013-10-31","2013-10-31"]
[2013,"Uchwała z 31.10.2013r.","BRZEZINY",1021011,1,null,520,"9.7.1",null,"   Dopuszczalny wskaźnik spłaty zobowiązań określony w art. 243 ustawy, po uwzględnieniu wyłączeń określonych w art.  36 ustawy z dnia 7 grudnia 2012 r. o zmianie niektórych ustaw w związku z realizacją ustawy budżetowej, obliczony w oparciu o wykonanie roku poprzedzającego rok budżetowy",true,9,2022,0.13009999999999999,"2013-10-31","2013-10-31"]
[2013,"Uchwała z 31.10.2013r.","BRZEZINY",1021011,1,null,520,"9.7.1",null,"   Dopuszczalny wskaźnik spłaty zobowiązań określony w art. 243 ustawy, po uwzględnieniu wyłączeń określonych w art.  36 ustawy z dnia 7 grudnia 2012 r. o zmianie niektórych ustaw w związku z realizacją ustawy budżetowej, obliczony w oparciu o wykonanie roku poprzedzającego rok budżetowy",true,0,2013,7.3200000000000001E-2,"2013-10-31","2013-10-31"]
[2013,"Uchwała z 31.10.2013r.","BRZEZINY",1021011,1,null,520,"9.7.1",null,"   Dopuszczalny wskaźnik spłaty zobowiązań określony w art. 243 ustawy, po uwzględnieniu wyłączeń określonych w art.  36 ustawy z dnia 7 grudnia 2012 r. o zmianie niektórych ustaw w związku z realizacją ustawy budżetowej, obliczony w oparciu o wykonanie roku poprzedzającego rok budżetowy",true,3,2016,0.1062,"2013-10-31","2013-10-31"]
[2013,"Uchwała z 31.10.2013r.","BRZEZINY",1021011,1,null,520,"9.7.1",null,"   Dopuszczalny wskaźnik spłaty zobowiązań określony w art. 243 ustawy, po uwzględnieniu wyłączeń określonych w art.  36 ustawy z dnia 7 grudnia 2012 r. o zmianie niektórych ustaw w związku z realizacją ustawy budżetowej, obliczony w oparciu o wykonanie roku poprzedzającego rok budżetowy",true,5,2018,0.1331,"2013-10-31","2013-10-31"]
[2013,"Uchwała z 31.10.2013r.","BRZEZINY",1021011,1,null,780,"12.4.2",null,"  Wydatki majątkowe na realizację programu, projektu lub zadania wynikające wyłącznie z zawartych umów z podmiotem dysponującym środkami, o których mowa w art. 5 ust. 1 pkt 2 ustawy ",true,0,2013,735014.91,"2013-10-31","2013-10-31"]
[2013,"Uchwała z 31.10.2013r.","BRZEZINY",1021011,1,null,190,2.2000000000000002,null," Wydatki majątkowe",false,7,2020,2749996,"2013-10-31","2013-10-31"]
[2013,"Uchwała z 31.10.2013r.","BRZEZINY",1021011,1,null,190,2.2000000000000002,null," Wydatki majątkowe",false,9,2022,2789996,"2013-10-31","2013-10-31"]
[2013,"Uchwała z 31.10.2013r.","BRZEZINY",1021011,1,null,190,2.2000000000000002,null," Wydatki majątkowe",false,4,2017,2294300,"2013-10-31","2013-10-31"]
[2013,"Uchwała z 31.10.2013r.","BRZEZINY",1021011,1,null,190,2.2000000000000002,null," Wydatki majątkowe",false,2,2015,3134308,"2013-10-31","2013-10-31"]
[2013,"Uchwała z 31.10.2013r.","BRZEZINY",1021011,1,null,190,2.2000000000000002,null," Wydatki majątkowe",false,10,2023,2730000,"2013-10-31","2013-10-31"]
[2013,"Uchwała z 31.10.2013r.","BRZEZINY",1021011,1,null,190,2.2000000000000002,null," Wydatki majątkowe",false,8,2021,2779996,"2013-10-31","2013-10-31"]
[2013,"Uchwała z 31.10.2013r.","BRZEZINY",1021011,1,null,190,2.2000000000000002,null," Wydatki majątkowe",false,6,2019,2719996,"2013-10-31","2013-10-31"]
[2013,"Uchwała z 31.10.2013r.","BRZEZINY",1021011,1,null,190,2.2000000000000002,null," Wydatki majątkowe",false,3,2016,2514304,"2013-10-31","2013-10-31"]
[2013,"Uchwała z 31.10.2013r.","BRZEZINY",1021011,1,null,190,2.2000000000000002,null," Wydatki majątkowe",false,5,2018,2591796,"2013-10-31","2013-10-31"]
[2013,"Uchwała z 31.10.2013r.","BRZEZINY",1021011,1,null,420,8.1,"[1.1] - [2.1]"," Różnica między dochodami bieżącymi a  wydatkami bieżącymi",false,7,2020,4360000,"2013-10-31","2013-10-31"]
[2013,"Uchwała z 31.10.2013r.","BRZEZINY",1021011,1,null,420,8.1,"[1.1] - [2.1]"," Różnica między dochodami bieżącymi a  wydatkami bieżącymi",false,10,2023,4440000,"2013-10-31","2013-10-31"]
[2013,"Uchwała z 31.10.2013r.","BRZEZINY",1021011,1,null,420,8.1,"[1.1] - [2.1]"," Różnica między dochodami bieżącymi a  wydatkami bieżącymi",false,5,2018,4270000,"2013-10-31","2013-10-31"]
[2013,"Uchwała z 31.10.2013r.","BRZEZINY",1021011,1,null,420,8.1,"[1.1] - [2.1]"," Różnica między dochodami bieżącymi a  wydatkami bieżącymi",false,8,2021,4390000,"2013-10-31","2013-10-31"]
[2013,"Uchwała z 31.10.2013r.","BRZEZINY",1021011,1,null,420,8.1,"[1.1] - [2.1]"," Różnica między dochodami bieżącymi a  wydatkami bieżącymi",false,2,2015,4350000,"2013-10-31","2013-10-31"]
[2013,"Uchwała z 31.10.2013r.","BRZEZINY",1021011,1,null,420,8.1,"[1.1] - [2.1]"," Różnica między dochodami bieżącymi a  wydatkami bieżącymi",false,4,2017,4210000,"2013-10-31","2013-10-31"]
[2013,"Uchwała z 31.10.2013r.","BRZEZINY",1021011,1,null,420,8.1,"[1.1] - [2.1]"," Różnica między dochodami bieżącymi a  wydatkami bieżącymi",false,0,2013,1126961.56,"2013-10-31","2013-10-31"]
[2013,"Uchwała z 31.10.2013r.","BRZEZINY",1021011,1,null,420,8.1,"[1.1] - [2.1]"," Różnica między dochodami bieżącymi a  wydatkami bieżącymi",false,6,2019,4330000,"2013-10-31","2013-10-31"]
[2013,"Uchwała z 31.10.2013r.","BRZEZINY",1021011,1,null,420,8.1,"[1.1] - [2.1]"," Różnica między dochodami bieżącymi a  wydatkami bieżącymi",false,9,2022,4440000,"2013-10-31","2013-10-31"]
[2013,"Uchwała z 31.10.2013r.","BRZEZINY",1021011,1,null,420,8.1,"[1.1] - [2.1]"," Różnica między dochodami bieżącymi a  wydatkami bieżącymi",false,1,2014,4621065.5599999996,"2013-10-31","2013-10-31"]
[2013,"Uchwała z 31.10.2013r.","BRZEZINY",1021011,1,null,420,8.1,"[1.1] - [2.1]"," Różnica między dochodami bieżącymi a  wydatkami bieżącymi",false,3,2016,4080000,"2013-10-31","2013-10-31"]
[2013,"Uchwała z 31.10.2013r.","BRZEZINY",1021011,1,null,720,"12.2.1.1",null,"    - w tym środki określone w art. 5 ust. 1 pkt 2 ustawy wynikające wyłącznie z zawartych umów na realizację programu, projektu lub zadania",false,0,2013,3052450.3,"2013-10-31","2013-10-31"]
[2013,"Uchwała z 31.10.2013r.","BRZEZINY",1021011,1,null,140,"2.1.1",null,"  z tytułu poręczeń i gwarancji",true,8,2021,101000,"2013-10-31","2013-10-31"]
[2013,"Uchwała z 31.10.2013r.","BRZEZINY",1021011,1,null,140,"2.1.1",null,"  z tytułu poręczeń i gwarancji",true,6,2019,110000,"2013-10-31","2013-10-31"]
[2013,"Uchwała z 31.10.2013r.","BRZEZINY",1021011,1,null,140,"2.1.1",null,"  z tytułu poręczeń i gwarancji",true,7,2020,110000,"2013-10-31","2013-10-31"]
[2013,"Uchwała z 31.10.2013r.","BRZEZINY",1021011,1,null,140,"2.1.1",null,"  z tytułu poręczeń i gwarancji",true,3,2016,110000,"2013-10-31","2013-10-31"]
[2013,"Uchwała z 31.10.2013r.","BRZEZINY",1021011,1,null,140,"2.1.1",null,"  z tytułu poręczeń i gwarancji",true,5,2018,110000,"2013-10-31","2013-10-31"]
[2013,"Uchwała z 31.10.2013r.","BRZEZINY",1021011,1,null,140,"2.1.1",null,"  z tytułu poręczeń i gwarancji",true,10,2023,59000,"2013-10-31","2013-10-31"]
[2013,"Uchwała z 31.10.2013r.","BRZEZINY",1021011,1,null,140,"2.1.1",null,"  z tytułu poręczeń i gwarancji",true,4,2017,110000,"2013-10-31","2013-10-31"]
[2013,"Uchwała z 31.10.2013r.","BRZEZINY",1021011,1,null,140,"2.1.1",null,"  z tytułu poręczeń i gwarancji",true,2,2015,110000,"2013-10-31","2013-10-31"]
[2013,"Uchwała z 31.10.2013r.","BRZEZINY",1021011,1,null,140,"2.1.1",null,"  z tytułu poręczeń i gwarancji",true,9,2022,59000,"2013-10-31","2013-10-31"]
[2013,"Uchwała z 31.10.2013r.","BRZEZINY",1021011,1,null,140,"2.1.1",null,"  z tytułu poręczeń i gwarancji",true,1,2014,110000,"2013-10-31","2013-10-31"]
[2013,"Uchwała z 31.10.2013r.","BRZEZINY",1021011,1,null,70,"1.1.4",null,"  z subwencji ogólnej",true,1,2014,8000000,"2013-10-31","2013-10-31"]
[2013,"Uchwała z 31.10.2013r.","BRZEZINY",1021011,1,null,70,"1.1.4",null,"  z subwencji ogólnej",true,10,2023,9100000,"2013-10-31","2013-10-31"]
[2013,"Uchwała z 31.10.2013r.","BRZEZINY",1021011,1,null,70,"1.1.4",null,"  z subwencji ogólnej",true,2,2015,7750000,"2013-10-31","2013-10-31"]
[2013,"Uchwała z 31.10.2013r.","BRZEZINY",1021011,1,null,70,"1.1.4",null,"  z subwencji ogólnej",true,7,2020,8500000,"2013-10-31","2013-10-31"]
[2013,"Uchwała z 31.10.2013r.","BRZEZINY",1021011,1,null,70,"1.1.4",null,"  z subwencji ogólnej",true,9,2022,8900000,"2013-10-31","2013-10-31"]
[2013,"Uchwała z 31.10.2013r.","BRZEZINY",1021011,1,null,70,"1.1.4",null,"  z subwencji ogólnej",true,5,2018,8200000,"2013-10-31","2013-10-31"]
[2013,"Uchwała z 31.10.2013r.","BRZEZINY",1021011,1,null,70,"1.1.4",null,"  z subwencji ogólnej",true,8,2021,8700000,"2013-10-31","2013-10-31"]
[2013,"Uchwała z 31.10.2013r.","BRZEZINY",1021011,1,null,70,"1.1.4",null,"  z subwencji ogólnej",true,6,2019,8350000,"2013-10-31","2013-10-31"]
[2013,"Uchwała z 31.10.2013r.","BRZEZINY",1021011,1,null,70,"1.1.4",null,"  z subwencji ogólnej",true,3,2016,7900000,"2013-10-31","2013-10-31"]
[2013,"Uchwała z 31.10.2013r.","BRZEZINY",1021011,1,null,70,"1.1.4",null,"  z subwencji ogólnej",true,4,2017,8050000,"2013-10-31","2013-10-31"]
[2013,"Uchwała z 31.10.2013r.","BRZEZINY",1021011,1,null,70,"1.1.4",null,"  z subwencji ogólnej",true,0,2013,7466452,"2013-10-31","2013-10-31"]
[2013,"Uchwała z 31.10.2013r.","BRZEZINY",1021011,1,null,50,"1.1.3",null,"  podatki i opłaty",true,10,2023,7650000,"2013-10-31","2013-10-31"]
[2013,"Uchwała z 31.10.2013r.","BRZEZINY",1021011,1,null,50,"1.1.3",null,"  podatki i opłaty",true,4,2017,6750000,"2013-10-31","2013-10-31"]
[2013,"Uchwała z 31.10.2013r.","BRZEZINY",1021011,1,null,50,"1.1.3",null,"  podatki i opłaty",true,3,2016,6600000,"2013-10-31","2013-10-31"]
[2013,"Uchwała z 31.10.2013r.","BRZEZINY",1021011,1,null,50,"1.1.3",null,"  podatki i opłaty",true,5,2018,6900000,"2013-10-31","2013-10-31"]
[2013,"Uchwała z 31.10.2013r.","BRZEZINY",1021011,1,null,50,"1.1.3",null,"  podatki i opłaty",true,7,2020,7200000,"2013-10-31","2013-10-31"]
[2013,"Uchwała z 31.10.2013r.","BRZEZINY",1021011,1,null,50,"1.1.3",null,"  podatki i opłaty",true,1,2014,6300000,"2013-10-31","2013-10-31"]
[2013,"Uchwała z 31.10.2013r.","BRZEZINY",1021011,1,null,50,"1.1.3",null,"  podatki i opłaty",true,2,2015,6450000,"2013-10-31","2013-10-31"]
[2013,"Uchwała z 31.10.2013r.","BRZEZINY",1021011,1,null,50,"1.1.3",null,"  podatki i opłaty",true,6,2019,7050000,"2013-10-31","2013-10-31"]
[2013,"Uchwała z 31.10.2013r.","BRZEZINY",1021011,1,null,50,"1.1.3",null,"  podatki i opłaty",true,0,2013,5853743.2999999998,"2013-10-31","2013-10-31"]
[2013,"Uchwała z 31.10.2013r.","BRZEZINY",1021011,1,null,50,"1.1.3",null,"  podatki i opłaty",true,8,2021,7350000,"2013-10-31","2013-10-31"]
[2013,"Uchwała z 31.10.2013r.","BRZEZINY",1021011,1,null,50,"1.1.3",null,"  podatki i opłaty",true,9,2022,7500000,"2013-10-31","2013-10-31"]
[2013,"Uchwała z 31.10.2013r.","BRZEZINY",1021011,1,null,130,2.1,null," Wydatki bieżące, w tym:",true,7,2020,29140000,"2013-10-31","2013-10-31"]
[2013,"Uchwała z 31.10.2013r.","BRZEZINY",1021011,1,null,130,2.1,null," Wydatki bieżące, w tym:",true,1,2014,26878935.149999999,"2013-10-31","2013-10-31"]
[2013,"Uchwała z 31.10.2013r.","BRZEZINY",1021011,1,null,130,2.1,null," Wydatki bieżące, w tym:",true,2,2015,27150000,"2013-10-31","2013-10-31"]
[2013,"Uchwała z 31.10.2013r.","BRZEZINY",1021011,1,null,130,2.1,null," Wydatki bieżące, w tym:",true,10,2023,30560000,"2013-10-31","2013-10-31"]
[2013,"Uchwała z 31.10.2013r.","BRZEZINY",1021011,1,null,130,2.1,null," Wydatki bieżące, w tym:",true,4,2017,27790000,"2013-10-31","2013-10-31"]
[2013,"Uchwała z 31.10.2013r.","BRZEZINY",1021011,1,null,130,2.1,null," Wydatki bieżące, w tym:",true,6,2019,28670000,"2013-10-31","2013-10-31"]
[2013,"Uchwała z 31.10.2013r.","BRZEZINY",1021011,1,null,130,2.1,null," Wydatki bieżące, w tym:",true,0,2013,31342902.25,"2013-10-31","2013-10-31"]
[2013,"Uchwała z 31.10.2013r.","BRZEZINY",1021011,1,null,130,2.1,null," Wydatki bieżące, w tym:",true,8,2021,29610000,"2013-10-31","2013-10-31"]
[2013,"Uchwała z 31.10.2013r.","BRZEZINY",1021011,1,null,130,2.1,null," Wydatki bieżące, w tym:",true,9,2022,30060000,"2013-10-31","2013-10-31"]
[2013,"Uchwała z 31.10.2013r.","BRZEZINY",1021011,1,null,130,2.1,null," Wydatki bieżące, w tym:",true,3,2016,27420000,"2013-10-31","2013-10-31"]
[2013,"Uchwała z 31.10.2013r.","BRZEZINY",1021011,1,null,130,2.1,null," Wydatki bieżące, w tym:",true,5,2018,28230000,"2013-10-31","2013-10-31"]
[2013,"Uchwała z 31.10.2013r.","BRZEZINY",1021011,1,null,180,"2.1.3.1",null,"   w tym odsetki i dyskonto określone w art. 243 ust. 1 ustawy lub art. 169 ust. 1 ufp z 2005 r..",false,10,2023,69000,"2013-10-31","2013-10-31"]
[2013,"Uchwała z 31.10.2013r.","BRZEZINY",1021011,1,null,180,"2.1.3.1",null,"   w tym odsetki i dyskonto określone w art. 243 ust. 1 ustawy lub art. 169 ust. 1 ufp z 2005 r..",false,2,2015,559000,"2013-10-31","2013-10-31"]
[2013,"Uchwała z 31.10.2013r.","BRZEZINY",1021011,1,null,180,"2.1.3.1",null,"   w tym odsetki i dyskonto określone w art. 243 ust. 1 ustawy lub art. 169 ust. 1 ufp z 2005 r..",false,0,2013,700000,"2013-10-31","2013-10-31"]
[2013,"Uchwała z 31.10.2013r.","BRZEZINY",1021011,1,null,180,"2.1.3.1",null,"   w tym odsetki i dyskonto określone w art. 243 ust. 1 ustawy lub art. 169 ust. 1 ufp z 2005 r..",false,4,2017,434000,"2013-10-31","2013-10-31"]
[2013,"Uchwała z 31.10.2013r.","BRZEZINY",1021011,1,null,180,"2.1.3.1",null,"   w tym odsetki i dyskonto określone w art. 243 ust. 1 ustawy lub art. 169 ust. 1 ufp z 2005 r..",false,3,2016,503000,"2013-10-31","2013-10-31"]
[2013,"Uchwała z 31.10.2013r.","BRZEZINY",1021011,1,null,180,"2.1.3.1",null,"   w tym odsetki i dyskonto określone w art. 243 ust. 1 ustawy lub art. 169 ust. 1 ufp z 2005 r..",false,9,2022,128000,"2013-10-31","2013-10-31"]
[2013,"Uchwała z 31.10.2013r.","BRZEZINY",1021011,1,null,180,"2.1.3.1",null,"   w tym odsetki i dyskonto określone w art. 243 ust. 1 ustawy lub art. 169 ust. 1 ufp z 2005 r..",false,7,2020,237000,"2013-10-31","2013-10-31"]
[2013,"Uchwała z 31.10.2013r.","BRZEZINY",1021011,1,null,180,"2.1.3.1",null,"   w tym odsetki i dyskonto określone w art. 243 ust. 1 ustawy lub art. 169 ust. 1 ufp z 2005 r..",false,8,2021,185000,"2013-10-31","2013-10-31"]
[2013,"Uchwała z 31.10.2013r.","BRZEZINY",1021011,1,null,180,"2.1.3.1",null,"   w tym odsetki i dyskonto określone w art. 243 ust. 1 ustawy lub art. 169 ust. 1 ufp z 2005 r..",false,6,2019,302000,"2013-10-31","2013-10-31"]
[2013,"Uchwała z 31.10.2013r.","BRZEZINY",1021011,1,null,180,"2.1.3.1",null,"   w tym odsetki i dyskonto określone w art. 243 ust. 1 ustawy lub art. 169 ust. 1 ufp z 2005 r..",false,5,2018,366000,"2013-10-31","2013-10-31"]
[2013,"Uchwała z 31.10.2013r.","BRZEZINY",1021011,1,null,180,"2.1.3.1",null,"   w tym odsetki i dyskonto określone w art. 243 ust. 1 ustawy lub art. 169 ust. 1 ufp z 2005 r..",false,1,2014,602000,"2013-10-31","2013-10-31"]
[2013,"Uchwała z 31.10.2013r.","BRZEZINY",1021011,1,null,510,9.6999999999999993,null," Dopuszczalny wskaźnik spłaty zobowiązań określony w art. 243 ustawy, po uwzględnieniu wyłączeń określonych w art. 36 ustawy z dnia 7 grudnia 2012 r. o zmianie niektórych ustaw w związku z realizacją ustawy budżetowej, obliczony w oparciu o plan 3 kwartałów roku poprzedzającego rok budżetowy",true,4,2017,0.1381,"2013-10-31","2013-10-31"]
[2013,"Uchwała z 31.10.2013r.","BRZEZINY",1021011,1,null,510,9.6999999999999993,null," Dopuszczalny wskaźnik spłaty zobowiązań określony w art. 243 ustawy, po uwzględnieniu wyłączeń określonych w art. 36 ustawy z dnia 7 grudnia 2012 r. o zmianie niektórych ustaw w związku z realizacją ustawy budżetowej, obliczony w oparciu o plan 3 kwartałów roku poprzedzającego rok budżetowy",true,2,2015,6.7599999999999993E-2,"2013-10-31","2013-10-31"]
[2013,"Uchwała z 31.10.2013r.","BRZEZINY",1021011,1,null,510,9.6999999999999993,null," Dopuszczalny wskaźnik spłaty zobowiązań określony w art. 243 ustawy, po uwzględnieniu wyłączeń określonych w art. 36 ustawy z dnia 7 grudnia 2012 r. o zmianie niektórych ustaw w związku z realizacją ustawy budżetowej, obliczony w oparciu o plan 3 kwartałów roku poprzedzającego rok budżetowy",true,9,2022,0.13009999999999999,"2013-10-31","2013-10-31"]
[2013,"Uchwała z 31.10.2013r.","BRZEZINY",1021011,1,null,510,9.6999999999999993,null," Dopuszczalny wskaźnik spłaty zobowiązań określony w art. 243 ustawy, po uwzględnieniu wyłączeń określonych w art. 36 ustawy z dnia 7 grudnia 2012 r. o zmianie niektórych ustaw w związku z realizacją ustawy budżetowej, obliczony w oparciu o plan 3 kwartałów roku poprzedzającego rok budżetowy",true,10,2023,0.1293,"2013-10-31","2013-10-31"]
[2013,"Uchwała z 31.10.2013r.","BRZEZINY",1021011,1,null,510,9.6999999999999993,null," Dopuszczalny wskaźnik spłaty zobowiązań określony w art. 243 ustawy, po uwzględnieniu wyłączeń określonych w art. 36 ustawy z dnia 7 grudnia 2012 r. o zmianie niektórych ustaw w związku z realizacją ustawy budżetowej, obliczony w oparciu o plan 3 kwartałów roku poprzedzającego rok budżetowy",true,7,2020,0.13139999999999999,"2013-10-31","2013-10-31"]
[2013,"Uchwała z 31.10.2013r.","BRZEZINY",1021011,1,null,510,9.6999999999999993,null," Dopuszczalny wskaźnik spłaty zobowiązań określony w art. 243 ustawy, po uwzględnieniu wyłączeń określonych w art. 36 ustawy z dnia 7 grudnia 2012 r. o zmianie niektórych ustaw w związku z realizacją ustawy budżetowej, obliczony w oparciu o plan 3 kwartałów roku poprzedzającego rok budżetowy",true,6,2019,0.1308,"2013-10-31","2013-10-31"]
[2013,"Uchwała z 31.10.2013r.","BRZEZINY",1021011,1,null,200,3,"[1] -[2]","Wynik budżetu",false,3,2016,1565696,"2013-10-31","2013-10-31"]
[2013,"Uchwała z 31.10.2013r.","BRZEZINY",1021011,1,null,200,3,"[1] -[2]","Wynik budżetu",false,7,2020,1610004,"2013-10-31","2013-10-31"]
[2013,"Uchwała z 31.10.2013r.","BRZEZINY",1021011,1,null,200,3,"[1] -[2]","Wynik budżetu",false,5,2018,1678204,"2013-10-31","2013-10-31"]
[2013,"Uchwała z 31.10.2013r.","BRZEZINY",1021011,1,null,510,9.6999999999999993,null," Dopuszczalny wskaźnik spłaty zobowiązań określony w art. 243 ustawy, po uwzględnieniu wyłączeń określonych w art. 36 ustawy z dnia 7 grudnia 2012 r. o zmianie niektórych ustaw w związku z realizacją ustawy budżetowej, obliczony w oparciu o plan 3 kwartałów roku poprzedzającego rok budżetowy",true,5,2018,0.1331,"2013-10-31","2013-10-31"]
[2013,"Uchwała z 31.10.2013r.","BRZEZINY",1021011,1,null,510,9.6999999999999993,null," Dopuszczalny wskaźnik spłaty zobowiązań określony w art. 243 ustawy, po uwzględnieniu wyłączeń określonych w art. 36 ustawy z dnia 7 grudnia 2012 r. o zmianie niektórych ustaw w związku z realizacją ustawy budżetowej, obliczony w oparciu o plan 3 kwartałów roku poprzedzającego rok budżetowy",true,1,2014,4.3499999999999997E-2,"2013-10-31","2013-10-31"]
[2013,"Uchwała z 31.10.2013r.","BRZEZINY",1021011,1,null,510,9.6999999999999993,null," Dopuszczalny wskaźnik spłaty zobowiązań określony w art. 243 ustawy, po uwzględnieniu wyłączeń określonych w art. 36 ustawy z dnia 7 grudnia 2012 r. o zmianie niektórych ustaw w związku z realizacją ustawy budżetowej, obliczony w oparciu o plan 3 kwartałów roku poprzedzającego rok budżetowy",true,0,2013,5.3699999999999998E-2,"2013-10-31","2013-10-31"]
[2013,"Uchwała z 31.10.2013r.","BRZEZINY",1021011,1,null,510,9.6999999999999993,null," Dopuszczalny wskaźnik spłaty zobowiązań określony w art. 243 ustawy, po uwzględnieniu wyłączeń określonych w art. 36 ustawy z dnia 7 grudnia 2012 r. o zmianie niektórych ustaw w związku z realizacją ustawy budżetowej, obliczony w oparciu o plan 3 kwartałów roku poprzedzającego rok budżetowy",true,8,2021,0.13089999999999999,"2013-10-31","2013-10-31"]
[2013,"Uchwała z 31.10.2013r.","BRZEZINY",1021011,1,null,510,9.6999999999999993,null," Dopuszczalny wskaźnik spłaty zobowiązań określony w art. 243 ustawy, po uwzględnieniu wyłączeń określonych w art. 36 ustawy z dnia 7 grudnia 2012 r. o zmianie niektórych ustaw w związku z realizacją ustawy budżetowej, obliczony w oparciu o plan 3 kwartałów roku poprzedzającego rok budżetowy",true,3,2016,0.1062,"2013-10-31","2013-10-31"]
[2013,"Uchwała z 31.10.2013r.","BRZEZINY",1021011,1,null,680,"12.1.1",null,"  -  w tym środki określone w art. 5 ust. 1 pkt 2 ustawy",true,0,2013,1776085.14,"2013-10-31","2013-10-31"]
[2013,"Uchwała z 31.10.2013r.","BRZEZINY",1021011,1,null,680,"12.1.1",null,"  -  w tym środki określone w art. 5 ust. 1 pkt 2 ustawy",true,1,2014,222594.71,"2013-10-31","2013-10-31"]
[2013,"Uchwała z 31.10.2013r.","BRZEZINY",1021011,1,null,40,"1.1.2",null,"  dochody z tytułu udziału we wpływach z podatku dochodowego od osób prawnych",true,5,2018,150000,"2013-10-31","2013-10-31"]
[2013,"Uchwała z 31.10.2013r.","BRZEZINY",1021011,1,null,40,"1.1.2",null,"  dochody z tytułu udziału we wpływach z podatku dochodowego od osób prawnych",true,3,2016,130000,"2013-10-31","2013-10-31"]
[2013,"Uchwała z 31.10.2013r.","BRZEZINY",1021011,1,null,40,"1.1.2",null,"  dochody z tytułu udziału we wpływach z podatku dochodowego od osób prawnych",true,6,2019,160000,"2013-10-31","2013-10-31"]
[2013,"Uchwała z 31.10.2013r.","BRZEZINY",1021011,1,null,40,"1.1.2",null,"  dochody z tytułu udziału we wpływach z podatku dochodowego od osób prawnych",true,2,2015,125000,"2013-10-31","2013-10-31"]
[2013,"Uchwała z 31.10.2013r.","BRZEZINY",1021011,1,null,40,"1.1.2",null,"  dochody z tytułu udziału we wpływach z podatku dochodowego od osób prawnych",true,9,2022,190000,"2013-10-31","2013-10-31"]
[2013,"Uchwała z 31.10.2013r.","BRZEZINY",1021011,1,null,40,"1.1.2",null,"  dochody z tytułu udziału we wpływach z podatku dochodowego od osób prawnych",true,1,2014,120000,"2013-10-31","2013-10-31"]
[2013,"Uchwała z 31.10.2013r.","BRZEZINY",1021011,1,null,40,"1.1.2",null,"  dochody z tytułu udziału we wpływach z podatku dochodowego od osób prawnych",true,10,2023,200000,"2013-10-31","2013-10-31"]
[2013,"Uchwała z 31.10.2013r.","BRZEZINY",1021011,1,null,40,"1.1.2",null,"  dochody z tytułu udziału we wpływach z podatku dochodowego od osób prawnych",true,7,2020,170000,"2013-10-31","2013-10-31"]
[2013,"Uchwała z 31.10.2013r.","BRZEZINY",1021011,1,null,40,"1.1.2",null,"  dochody z tytułu udziału we wpływach z podatku dochodowego od osób prawnych",true,0,2013,120000,"2013-10-31","2013-10-31"]
[2013,"Uchwała z 31.10.2013r.","BRZEZINY",1021011,1,null,40,"1.1.2",null,"  dochody z tytułu udziału we wpływach z podatku dochodowego od osób prawnych",true,4,2017,140000,"2013-10-31","2013-10-31"]
[2013,"Uchwała z 31.10.2013r.","BRZEZINY",1021011,1,null,40,"1.1.2",null,"  dochody z tytułu udziału we wpływach z podatku dochodowego od osób prawnych",true,8,2021,180000,"2013-10-31","2013-10-31"]
[2013,"Uchwała z 31.10.2013r.","BRZEZINY",1021011,1,null,100,"1.2.1",null,"  ze sprzedaży majątku",true,0,2013,125000,"2013-10-31","2013-10-31"]
[2013,"Uchwała z 31.10.2013r.","BRZEZINY",1021011,1,null,200,3,"[1] -[2]","Wynik budżetu",false,6,2019,1610004,"2013-10-31","2013-10-31"]
[2013,"Uchwała z 31.10.2013r.","BRZEZINY",1021011,1,null,200,3,"[1] -[2]","Wynik budżetu",false,8,2021,1610004,"2013-10-31","2013-10-31"]
[2013,"Uchwała z 31.10.2013r.","BRZEZINY",1021011,1,null,200,3,"[1] -[2]","Wynik budżetu",false,2,2015,1215692,"2013-10-31","2013-10-31"]
[2013,"Uchwała z 31.10.2013r.","BRZEZINY",1021011,1,null,200,3,"[1] -[2]","Wynik budżetu",false,1,2014,938060.16,"2013-10-31","2013-10-31"]
[2013,"Uchwała z 31.10.2013r.","BRZEZINY",1021011,1,null,200,3,"[1] -[2]","Wynik budżetu",false,0,2013,-2607411.2200000002,"2013-10-31","2013-10-31"]
[2013,"Uchwała z 31.10.2013r.","BRZEZINY",1021011,1,null,200,3,"[1] -[2]","Wynik budżetu",false,10,2023,1710000,"2013-10-31","2013-10-31"]
[2013,"Uchwała z 31.10.2013r.","BRZEZINY",1021011,1,null,200,3,"[1] -[2]","Wynik budżetu",false,9,2022,1650004,"2013-10-31","2013-10-31"]
[2013,"Uchwała z 31.10.2013r.","BRZEZINY",1021011,1,null,200,3,"[1] -[2]","Wynik budżetu",false,4,2017,1915700,"2013-10-31","2013-10-31"]
[2013,"Uchwała z 31.10.2013r.","BRZEZINY",1021011,1,null,640,11.5,null," Nowe wydatki inwestycyjne",true,0,2013,2967740.56,"2013-10-31","2013-10-31"]
[2013,"Uchwała z 31.10.2013r.","BRZEZINY",1021011,1,null,650,11.6,null," Wydatki majątkowe w formie dotacji ",true,0,2013,380000,"2013-10-31","2013-10-31"]
[2013,"Uchwała z 31.10.2013r.","BRZEZINY",1021011,1,null,430,8.1999999999999993,"[1.1] + [4.1] + [4.2] - (  [2.1] - [2.1.2]  )"," Różnica między dochodami bieżącymi, powiększonymi o nadwyżkę budżetową określoną w pkt 4.1. i wolne środki określone w pkt 4.2.  a wydatkami bieżącymi, pomniejszonym o wydatki określone w pkt  2.1.2.",false,5,2018,4270000,"2013-10-31","2013-10-31"]
[2013,"Uchwała z 31.10.2013r.","BRZEZINY",1021011,1,null,430,8.1999999999999993,"[1.1] + [4.1] + [4.2] - (  [2.1] - [2.1.2]  )"," Różnica między dochodami bieżącymi, powiększonymi o nadwyżkę budżetową określoną w pkt 4.1. i wolne środki określone w pkt 4.2.  a wydatkami bieżącymi, pomniejszonym o wydatki określone w pkt  2.1.2.",false,7,2020,4360000,"2013-10-31","2013-10-31"]
[2013,"Uchwała z 31.10.2013r.","BRZEZINY",1021011,1,null,430,8.1999999999999993,"[1.1] + [4.1] + [4.2] - (  [2.1] - [2.1.2]  )"," Różnica między dochodami bieżącymi, powiększonymi o nadwyżkę budżetową określoną w pkt 4.1. i wolne środki określone w pkt 4.2.  a wydatkami bieżącymi, pomniejszonym o wydatki określone w pkt  2.1.2.",false,0,2013,3734372.78,"2013-10-31","2013-10-31"]
[2013,"Uchwała z 31.10.2013r.","BRZEZINY",1021011,1,null,430,8.1999999999999993,"[1.1] + [4.1] + [4.2] - (  [2.1] - [2.1.2]  )"," Różnica między dochodami bieżącymi, powiększonymi o nadwyżkę budżetową określoną w pkt 4.1. i wolne środki określone w pkt 4.2.  a wydatkami bieżącymi, pomniejszonym o wydatki określone w pkt  2.1.2.",false,8,2021,4390000,"2013-10-31","2013-10-31"]
[2013,"Uchwała z 31.10.2013r.","BRZEZINY",1021011,1,null,430,8.1999999999999993,"[1.1] + [4.1] + [4.2] - (  [2.1] - [2.1.2]  )"," Różnica między dochodami bieżącymi, powiększonymi o nadwyżkę budżetową określoną w pkt 4.1. i wolne środki określone w pkt 4.2.  a wydatkami bieżącymi, pomniejszonym o wydatki określone w pkt  2.1.2.",false,6,2019,4330000,"2013-10-31","2013-10-31"]
[2013,"Uchwała z 31.10.2013r.","BRZEZINY",1021011,1,null,430,8.1999999999999993,"[1.1] + [4.1] + [4.2] - (  [2.1] - [2.1.2]  )"," Różnica między dochodami bieżącymi, powiększonymi o nadwyżkę budżetową określoną w pkt 4.1. i wolne środki określone w pkt 4.2.  a wydatkami bieżącymi, pomniejszonym o wydatki określone w pkt  2.1.2.",false,9,2022,4440000,"2013-10-31","2013-10-31"]
[2013,"Uchwała z 31.10.2013r.","BRZEZINY",1021011,1,null,430,8.1999999999999993,"[1.1] + [4.1] + [4.2] - (  [2.1] - [2.1.2]  )"," Różnica między dochodami bieżącymi, powiększonymi o nadwyżkę budżetową określoną w pkt 4.1. i wolne środki określone w pkt 4.2.  a wydatkami bieżącymi, pomniejszonym o wydatki określone w pkt  2.1.2.",false,2,2015,4350000,"2013-10-31","2013-10-31"]
[2013,"Uchwała z 31.10.2013r.","BRZEZINY",1021011,1,null,430,8.1999999999999993,"[1.1] + [4.1] + [4.2] - (  [2.1] - [2.1.2]  )"," Różnica między dochodami bieżącymi, powiększonymi o nadwyżkę budżetową określoną w pkt 4.1. i wolne środki określone w pkt 4.2.  a wydatkami bieżącymi, pomniejszonym o wydatki określone w pkt  2.1.2.",false,10,2023,4440000,"2013-10-31","2013-10-31"]
[2013,"Uchwała z 31.10.2013r.","BRZEZINY",1021011,1,null,430,8.1999999999999993,"[1.1] + [4.1] + [4.2] - (  [2.1] - [2.1.2]  )"," Różnica między dochodami bieżącymi, powiększonymi o nadwyżkę budżetową określoną w pkt 4.1. i wolne środki określone w pkt 4.2.  a wydatkami bieżącymi, pomniejszonym o wydatki określone w pkt  2.1.2.",false,4,2017,4210000,"2013-10-31","2013-10-31"]
[2013,"Uchwała z 31.10.2013r.","BRZEZINY",1021011,1,null,430,8.1999999999999993,"[1.1] + [4.1] + [4.2] - (  [2.1] - [2.1.2]  )"," Różnica między dochodami bieżącymi, powiększonymi o nadwyżkę budżetową określoną w pkt 4.1. i wolne środki określone w pkt 4.2.  a wydatkami bieżącymi, pomniejszonym o wydatki określone w pkt  2.1.2.",false,1,2014,4621065.5599999996,"2013-10-31","2013-10-31"]
[2013,"Uchwała z 31.10.2013r.","BRZEZINY",1021011,1,null,430,8.1999999999999993,"[1.1] + [4.1] + [4.2] - (  [2.1] - [2.1.2]  )"," Różnica między dochodami bieżącymi, powiększonymi o nadwyżkę budżetową określoną w pkt 4.1. i wolne środki określone w pkt 4.2.  a wydatkami bieżącymi, pomniejszonym o wydatki określone w pkt  2.1.2.",false,3,2016,4080000,"2013-10-31","2013-10-31"]
[2013,"Uchwała z 31.10.2013r.","BRZEZINY",1021011,1,null,30,"1.1.1",null,"  dochody z tytułu udziału we wpływach z podatku dochodowego od osób fizycznych",true,4,2017,7900000,"2013-10-31","2013-10-31"]
[2013,"Uchwała z 31.10.2013r.","BRZEZINY",1021011,1,null,30,"1.1.1",null,"  dochody z tytułu udziału we wpływach z podatku dochodowego od osób fizycznych",true,3,2016,7600000,"2013-10-31","2013-10-31"]
[2013,"Uchwała z 31.10.2013r.","BRZEZINY",1021011,1,null,30,"1.1.1",null,"  dochody z tytułu udziału we wpływach z podatku dochodowego od osób fizycznych",true,8,2021,9100000,"2013-10-31","2013-10-31"]
[2013,"Uchwała z 31.10.2013r.","BRZEZINY",1021011,1,null,30,"1.1.1",null,"  dochody z tytułu udziału we wpływach z podatku dochodowego od osób fizycznych",true,6,2019,8500000,"2013-10-31","2013-10-31"]
[2013,"Uchwała z 31.10.2013r.","BRZEZINY",1021011,1,null,30,"1.1.1",null,"  dochody z tytułu udziału we wpływach z podatku dochodowego od osób fizycznych",true,7,2020,8800000,"2013-10-31","2013-10-31"]
[2013,"Uchwała z 31.10.2013r.","BRZEZINY",1021011,1,null,30,"1.1.1",null,"  dochody z tytułu udziału we wpływach z podatku dochodowego od osób fizycznych",true,1,2014,7000000,"2013-10-31","2013-10-31"]
[2013,"Uchwała z 31.10.2013r.","BRZEZINY",1021011,1,null,30,"1.1.1",null,"  dochody z tytułu udziału we wpływach z podatku dochodowego od osób fizycznych",true,10,2023,9700000,"2013-10-31","2013-10-31"]
[2013,"Uchwała z 31.10.2013r.","BRZEZINY",1021011,1,null,30,"1.1.1",null,"  dochody z tytułu udziału we wpływach z podatku dochodowego od osób fizycznych",true,5,2018,8200000,"2013-10-31","2013-10-31"]
[2013,"Uchwała z 31.10.2013r.","BRZEZINY",1021011,1,null,30,"1.1.1",null,"  dochody z tytułu udziału we wpływach z podatku dochodowego od osób fizycznych",true,9,2022,9400000,"2013-10-31","2013-10-31"]
[2013,"Uchwała z 31.10.2013r.","BRZEZINY",1021011,1,null,30,"1.1.1",null,"  dochody z tytułu udziału we wpływach z podatku dochodowego od osób fizycznych",true,2,2015,7300000,"2013-10-31","2013-10-31"]
[2013,"Uchwała z 31.10.2013r.","BRZEZINY",1021011,1,null,30,"1.1.1",null,"  dochody z tytułu udziału we wpływach z podatku dochodowego od osób fizycznych",true,0,2013,6700000,"2013-10-31","2013-10-31"]
[2013,"Uchwała z 31.10.2013r.","BRZEZINY",1021011,1,null,760,12.4,null," Wydatki majątkowe na programy, projekty lub zadania finansowane z udziałem środków, o których mowa w art. 5 ust. 1 pkt 2 i 3 ustawy",true,0,2013,735014.91,"2013-10-31","2013-10-31"]
[2013,"Uchwała z 31.10.2013r.","BRZEZINY",1021011,1,null,505,"9.6.1","( [1.1] -  ( [2.1]  - [2.1.2] ) + [1.2.1] ) / [1]"," Wskaźnik jednoroczny",false,2,2015,0.1381,"2013-10-31","2013-10-31"]
[2013,"Uchwała z 31.10.2013r.","BRZEZINY",1021011,1,null,505,"9.6.1","( [1.1] -  ( [2.1]  - [2.1.2] ) + [1.2.1] ) / [1]"," Wskaźnik jednoroczny",false,6,2019,0.13120000000000001,"2013-10-31","2013-10-31"]
[2013,"Uchwała z 31.10.2013r.","BRZEZINY",1021011,1,null,505,"9.6.1","( [1.1] -  ( [2.1]  - [2.1.2] ) + [1.2.1] ) / [1]"," Wskaźnik jednoroczny",false,7,2020,0.13009999999999999,"2013-10-31","2013-10-31"]
[2013,"Uchwała z 31.10.2013r.","BRZEZINY",1021011,1,null,505,"9.6.1","( [1.1] -  ( [2.1]  - [2.1.2] ) + [1.2.1] ) / [1]"," Wskaźnik jednoroczny",false,0,2013,3.3700000000000001E-2,"2013-10-31","2013-10-31"]
[2013,"Uchwała z 31.10.2013r.","BRZEZINY",1021011,1,null,505,"9.6.1","( [1.1] -  ( [2.1]  - [2.1.2] ) + [1.2.1] ) / [1]"," Wskaźnik jednoroczny",false,10,2023,0.12690000000000001,"2013-10-31","2013-10-31"]
[2013,"Uchwała z 31.10.2013r.","BRZEZINY",1021011,1,null,505,"9.6.1","( [1.1] -  ( [2.1]  - [2.1.2] ) + [1.2.1] ) / [1]"," Wskaźnik jednoroczny",false,1,2014,0.1467,"2013-10-31","2013-10-31"]
[2013,"Uchwała z 31.10.2013r.","BRZEZINY",1021011,1,null,505,"9.6.1","( [1.1] -  ( [2.1]  - [2.1.2] ) + [1.2.1] ) / [1]"," Wskaźnik jednoroczny",false,3,2016,0.1295,"2013-10-31","2013-10-31"]
[2013,"Uchwała z 31.10.2013r.","BRZEZINY",1021011,1,null,505,"9.6.1","( [1.1] -  ( [2.1]  - [2.1.2] ) + [1.2.1] ) / [1]"," Wskaźnik jednoroczny",false,5,2018,0.13139999999999999,"2013-10-31","2013-10-31"]
[2013,"Uchwała z 31.10.2013r.","BRZEZINY",1021011,1,null,505,"9.6.1","( [1.1] -  ( [2.1]  - [2.1.2] ) + [1.2.1] ) / [1]"," Wskaźnik jednoroczny",false,9,2022,0.12870000000000001,"2013-10-31","2013-10-31"]
[2013,"Uchwała z 31.10.2013r.","BRZEZINY",1021011,1,null,505,"9.6.1","( [1.1] -  ( [2.1]  - [2.1.2] ) + [1.2.1] ) / [1]"," Wskaźnik jednoroczny",false,4,2017,0.13159999999999999,"2013-10-31","2013-10-31"]
[2013,"Uchwała z 31.10.2013r.","BRZEZINY",1021011,1,null,505,"9.6.1","( [1.1] -  ( [2.1]  - [2.1.2] ) + [1.2.1] ) / [1]"," Wskaźnik jednoroczny",false,8,2021,0.12909999999999999,"2013-10-31","2013-10-31"]

{"sheet":"DaneZrodloweDoWsk","index":3,"n_rows":62,"n_cols":18,"rows_kept":62,"cut":false,"hidden":true,"merged":[]}
["Wyciąg danych z tabeli \"Wieloletnia prognoza finansowa\" wprowadzonych do systemu BESTI@ z wybranej uchwały ",null,null,null,null,null,null,null,null,null,null,"Rok bazowy:",{"$f":"MIN(L:L)","v":2013}]
[]
["budzet","numer","nazwajst","kodgus","gt","mswia","lp","symbol","formula","wyszczegolnienie","wsk243","rokprognozy","WYK_N_3","WYK_N_2","PLN_N_1","WYK_N_1","DataPodjecia","DataWejscia"]
[2013,"Uchwała z 31.10.2013r.","BRZEZINY",1021011,1,null,670,12.1,null," Dochody bieżące  na programy, projekty lub zadania finansowane z udziałem środków, o których mowa w art. 5 ust. 1 pkt 2 i 3 ustawy",true,2013,0,0,0,931390.39,"2013-10-31","2013-10-31"]
[2013,"Uchwała z 31.10.2013r.","BRZEZINY",1021011,1,null,610,"11.3.1",null,"   bieżące",true,2013,0,0,994525,0,"2013-10-31","2013-10-31"]
[2013,"Uchwała z 31.10.2013r.","BRZEZINY",1021011,1,null,750,"12.3.2",null,"  Wydatki bieżące na realizację programu, projektu lub zadania wynikające wyłącznie z zawartych umów z podmiotem dysponującym środkami, o których mowa w art. 5 ust. 1 pkt 2 ustawy ",false,2013,0,0,0,0,"2013-10-31","2013-10-31"]
[2013,"Uchwała z 31.10.2013r.","BRZEZINY",1021011,1,null,310,5.0999999999999996,null," Spłaty rat kapitałowych kredytów i pożyczek oraz wykup papierów wartościowych",true,2013,1916539.28,2541577.2799999998,1904000,1903176.7,"2013-10-31","2013-10-31"]
[2013,"Uchwała z 31.10.2013r.","BRZEZINY",1021011,1,null,90,1.2,null,"  Dochody majątkowe, w tym",true,2013,5591089.8300000001,2650951.14,5708395.4800000004,5020533.8099999996,"2013-10-31","2013-10-31"]
[2013,"Uchwała z 31.10.2013r.","BRZEZINY",1021011,1,null,500,9.6,"([2.1.1]+[2.1.3.1] + [5.1]+[9.5]-[5.1.1]- [2.1.1.1] )/[1]"," Wskaźnik planowanej łącznej kwoty spłaty zobowiązań, o której mowa w art. 243 ust. 1 ustawy do dochodów ogółem, po uwzględnieniu zobowiązań związku współtworzonego przez jednostkę samorządu terytorialnego oraz po uwzględnieniu wyłączeń przypadających na dany rok określonych w pkt 5.1.1.",false,2013,7.5600000000000001E-2,0.1061,7.9699999999999993E-2,7.8200000000000006E-2,"2013-10-31","2013-10-31"]
[2013,"Uchwała z 31.10.2013r.","BRZEZINY",1021011,1,null,710,"12.2.1",null,"   -  w tym środki określone w art. 5 ust. 1 pkt 2 ustawy",false,2013,3773685.71,0,3830155.48,3113726.16,"2013-10-31","2013-10-31"]
[2013,"Uchwała z 31.10.2013r.","BRZEZINY",1021011,1,null,380,6.2,"[6] / [1]"," Wskaźnik zadłużenia do dochodów ogółem określony w art. 170 ufp z 2005 r., bez uwzględniania wyłączeń określonych w pkt 6.1.   ",false,2013,0.40810000000000002,0.44769999999999999,0.44409999999999999,0.45019999999999999,"2013-10-31","2013-10-31"]
[2013,"Uchwała z 31.10.2013r.","BRZEZINY",1021011,1,null,20,1.1000000000000001,null," Dochody bieżące",true,2013,25893786.18,28412491.190000001,29915724.449999999,29417886.460000001,"2013-10-31","2013-10-31"]
[2013,"Uchwała z 31.10.2013r.","BRZEZINY",1021011,1,null,770,"12.4.1",null,"  -  w tym finansowane środkami określonymi w art. 5 ust. 1 pkt 2 ustawy",true,2013,0,0,3830155.48,3360023.79,"2013-10-31","2013-10-31"]
[2013,"Uchwała z 31.10.2013r.","BRZEZINY",1021011,1,null,260,4.3,null,"  Kredyty, pożyczki, emisja papierów wartościowych",true,2013,6000000,3600000,3818747.09,3500000,"2013-10-31","2013-10-31"]
[2013,"Uchwała z 31.10.2013r.","BRZEZINY",1021011,1,null,600,11.3,"[11.3.1] + [11.3.2]"," Wydatki objęte limitem art. 226 ust. 3 ustawy",true,2013,0,0,1841325,0,"2013-10-31","2013-10-31"]
[2013,"Uchwała z 31.10.2013r.","BRZEZINY",1021011,1,null,10,1,"[1.1] + [1.2]","Dochody ogółem",true,2013,31484876.010000002,31063442.329999998,35624119.93,34438420.270000003,"2013-10-31","2013-10-31"]
[2013,"Uchwała z 31.10.2013r.","BRZEZINY",1021011,1,null,590,11.2,null," Wydatki związane z funkcjonowaniem organów jednostki samorządu terytorialnego",true,2013,0,0,0,0,"2013-10-31","2013-10-31"]
[2013,"Uchwała z 31.10.2013r.","BRZEZINY",1021011,1,null,580,11.1,null," Wydatki bieżące na wynagrodzenia i składki od nich naliczane",false,2013,10915139.42,0,12203062,12006826.01,"2013-10-31","2013-10-31"]
[2013,"Uchwała z 31.10.2013r.","BRZEZINY",1021011,1,null,170,"2.1.3",null,"  wydatki na obsługę długu",true,2013,464051.55,755389.64,884400,791159.57,"2013-10-31","2013-10-31"]
[2013,"Uchwała z 31.10.2013r.","BRZEZINY",1021011,1,null,730,12.3,null," Wydatki bieżące na programy, projekty lub zadania finansowane z udziałem środków, o których mowa w art. 5 ust. 1 pkt 2 i 3 ustawy",false,2013,0,0,0,0,"2013-10-31","2013-10-31"]
[2013,"Uchwała z 31.10.2013r.","BRZEZINY",1021011,1,null,880,14.1,null," Spłaty rat kapitałowych oraz wykup papierów wartościowych, o których mowa w pkt. 5.1., wynikające wyłącznie z tytułu zobowiązań już zaciągniętych",true,2013,0,0,0,0,"2013-10-31","2013-10-31"]
[2013,"Uchwała z 31.10.2013r.","BRZEZINY",1021011,1,null,110,"1.2.2",null,"  z tytułu dotacji oraz środków przeznaczonych na inwestycje",true,2013,0,0,0,0,"2013-10-31","2013-10-31"]
[2013,"Uchwała z 31.10.2013r.","BRZEZINY",1021011,1,null,80,"1.1.5",null,"  z tytułu dotacji i środków przeznaczonych na cele bieżące",true,2013,0,0,0,0,"2013-10-31","2013-10-31"]
[2013,"Uchwała z 31.10.2013r.","BRZEZINY",1021011,1,null,460,9.1999999999999993,"([2.1.1] + [2.1.3.1] + [5.1] - [5.1.1]- [2.1.1.1] ) / [1]"," Wskaźnik planowanej łącznej kwoty spłaty zobowiązań, o której mowa w art. 169 ust. 1 ufp z 2005 r. do dochodów ogółem, po uwzględnieniu wyłączeń przypadających na dany rok określonych w pkt 5.1.1. ",false,2013,7.5600000000000001E-2,0.1061,7.9699999999999993E-2,7.8200000000000006E-2,"2013-10-31","2013-10-31"]
[2013,"Uchwała z 31.10.2013r.","BRZEZINY",1021011,1,null,300,5,"[5.1] + [5.2]","Rozchody budżetu",false,2013,1916539.28,2541577.2799999998,1904000,1903176.7,"2013-10-31","2013-10-31"]
[2013,"Uchwała z 31.10.2013r.","BRZEZINY",1021011,1,null,700,12.2,null," Dochody majątkowe  na programy, projekty lub zadania finansowane z udziałem środków, o których mowa w art. 5 ust. 1 pkt 2 i 3 ustawy",false,2013,0,0,0,0,"2013-10-31","2013-10-31"]
[2013,"Uchwała z 31.10.2013r.","BRZEZINY",1021011,1,null,630,11.4,null," Wydatki inwestycyjne kontynuowane ",true,2013,0,0,0,0,"2013-10-31","2013-10-31"]
[2013,"Uchwała z 31.10.2013r.","BRZEZINY",1021011,1,null,120,2,"[2.1] + [2.2]","Wydatki ogółem",false,2013,34609335.700000003,31037203.93,40495660.859999999,36384626.189999998,"2013-10-31","2013-10-31"]
[2013,"Uchwała z 31.10.2013r.","BRZEZINY",1021011,1,null,530,9.8000000000000007,"[9.6] - [9.7]"," Informacja o spełnieniu wskaźnika spłaty zobowiązań określonego w art. 243 ustawy, po uwzględnieniu zobowiązań związku współtworzonego przez jednostkę samorządu terytorialnego oraz po uwzględnieniu wyłączeń określonych w pkt 5.1.1., obliczonego w oparciu o plan 3 kwartałów roku poprzedzającego rok budżetowy",false,2013,7.5600000000000001E-2,0.1061,7.9699999999999993E-2,7.8200000000000006E-2,"2013-10-31","2013-10-31"]
[2013,"Uchwała z 31.10.2013r.","BRZEZINY",1021011,1,null,350,6,null,"Kwota długu",true,2013,12848122.140000001,13906544.859999999,15821291.949999999,15503368.16,"2013-10-31","2013-10-31"]
[2013,"Uchwała z 31.10.2013r.","BRZEZINY",1021011,1,null,210,4,"[4.1] + [4.2] + [4.3] + [4.4]","Przychody budżetu",false,2013,6000000,3600000,6775540.9299999997,6456793.8399999999,"2013-10-31","2013-10-31"]
[2013,"Uchwała z 31.10.2013r.","BRZEZINY",1021011,1,null,60,"1.1.3.1",null,"   z podatku od nieruchomości",true,2013,0,0,0,0,"2013-10-31","2013-10-31"]
[2013,"Uchwała z 31.10.2013r.","BRZEZINY",1021011,1,null,740,"12.3.1",null,"  -  w tym finansowane środkami określonymi w art. 5 ust. 1 pkt 2 ustawy ",false,2013,0,0,1221877.52,1128926.8899999999,"2013-10-31","2013-10-31"]
[2013,"Uchwała z 31.10.2013r.","BRZEZINY",1021011,1,null,470,9.3000000000000007,"([2.1.1] + [2.1.3.1] + [5.1] ) / [1]"," Wskaźnik planowanej łącznej kwoty spłaty zobowiązań, o której mowa w art. 243 ust. 1 ustawy do dochodów ogółem, bez uwzględnienia zobowiązań związku współtworzonego przez jednostkę samorządu terytorialnego  i bez uwzględniania wyłączeń przypadających na dany rok określonych w pkt 5.1.1.",true,2013,7.5600000000000001E-2,0.1061,7.9699999999999993E-2,7.8200000000000006E-2,"2013-10-31","2013-10-31"]
[2013,"Uchwała z 31.10.2013r.","BRZEZINY",1021011,1,null,620,"11.3.2",null,"   majątkowe",true,2013,0,0,846800,0,"2013-10-31","2013-10-31"]
[2013,"Uchwała z 31.10.2013r.","BRZEZINY",1021011,1,null,540,"9.8.1","[9.6] - [9.7.1]","  Informacja o spełnieniu wskaźnika spłaty zobowiązań określonego w art. 243 ustawy, po uwzględnieniu zobowiązań związku współtworzonego przez jednostkę samorządu terytorialnego oraz po uwzględnieniu wyłączeń określonych w pkt 5.1.1., obliczonego w oparciu o wykonanie roku poprzedzającego rok budżetowy",false,2013,7.5600000000000001E-2,0.1061,7.9699999999999993E-2,7.8200000000000006E-2,"2013-10-31","2013-10-31"]
[2013,"Uchwała z 31.10.2013r.","BRZEZINY",1021011,1,null,240,4.2,null," Wolne środki, o których mowa w art. 217 ust.2 pkt 6 ustawy",false,2013,0,0,2956793.84,2956793.84,"2013-10-31","2013-10-31"]
[2013,"Uchwała z 31.10.2013r.","BRZEZINY",1021011,1,null,450,9.1,"([2.1.1] + [2.1.3.1] + [5.1] ) / [1]"," Wskaźnik planowanej łącznej kwoty spłaty zobowiązań, o której mowa w art. 169 ust. 1 ufp z 2005 r. do dochodów ogółem, bez uwzględnienia wyłączeń określonych w pkt 5.1.1.  ",true,2013,7.5600000000000001E-2,0.1061,7.9699999999999993E-2,7.8200000000000006E-2,"2013-10-31","2013-10-31"]
[2013,"Uchwała z 31.10.2013r.","BRZEZINY",1021011,1,null,250,"4.2.1",null,"   w tym na pokrycie deficytu budżetu",false,2013,0,0,1052793.8400000001,1052793.8400000001,"2013-10-31","2013-10-31"]
[2013,"Uchwała z 31.10.2013r.","BRZEZINY",1021011,1,null,690,"12.1.1.1",null,"   - w tym środki określone w art. 5 ust. 1 pkt 2 ustawy wynikające wyłącznie z  zawartych umów na realizację programu, projektu lub zadania",true,2013,0,0,0,0,"2013-10-31","2013-10-31"]
[2013,"Uchwała z 31.10.2013r.","BRZEZINY",1021011,1,null,480,9.4,"([2.1.1] + [2.1.3.1] + [5.1] - [5.1.1]- [2.1.1.1] ) / [1]"," Wskaźnik planowanej łącznej kwoty spłaty zobowiązań, o której mowa w art. 243 ust. 1 ustawy do dochodów ogółem, bez uwzględnienia zobowiązań związku współtworzonego przez jednostkę samorządu terytorialnego, po uwzględnieniu wyłączeń przypadających na dany rok określonych w pkt 5.1.1. ",false,2013,7.5600000000000001E-2,0.1061,7.9699999999999993E-2,7.8200000000000006E-2,"2013-10-31","2013-10-31"]
[2013,"Uchwała z 31.10.2013r.","BRZEZINY",1021011,1,null,390,6.3,"([6] - [6.1]) / [1]"," Wskaźnik zadłużenia do dochodów ogółem, o którym mowa w art.  170 ufp z 2005 r., po uwzględnieniu wyłączeń określonych w pkt 6.1. ",false,2013,0.40810000000000002,0.44769999999999999,0.44409999999999999,0.45019999999999999,"2013-10-31","2013-10-31"]
[2013,"Uchwała z 31.10.2013r.","BRZEZINY",1021011,1,null,520,"9.7.1",null,"   Dopuszczalny wskaźnik spłaty zobowiązań określony w art. 243 ustawy, po uwzględnieniu wyłączeń określonych w art.  36 ustawy z dnia 7 grudnia 2012 r. o zmianie niektórych ustaw w związku z realizacją ustawy budżetowej, obliczony w oparciu o wykonanie roku poprzedzającego rok budżetowy",true,2013,0,0,0,0,"2013-10-31","2013-10-31"]
[2013,"Uchwała z 31.10.2013r.","BRZEZINY",1021011,1,null,780,"12.4.2",null,"  Wydatki majątkowe na realizację programu, projektu lub zadania wynikające wyłącznie z zawartych umów z podmiotem dysponującym środkami, o których mowa w art. 5 ust. 1 pkt 2 ustawy ",true,2013,0,0,0,0,"2013-10-31","2013-10-31"]
[2013,"Uchwała z 31.10.2013r.","BRZEZINY",1021011,1,null,190,2.2000000000000002,null," Wydatki majątkowe",false,2013,9401653.7300000004,4907950.29,11277160.42,9599595.8900000006,"2013-10-31","2013-10-31"]
[2013,"Uchwała z 31.10.2013r.","BRZEZINY",1021011,1,null,420,8.1,"[1.1] - [2.1]"," Różnica między dochodami bieżącymi a  wydatkami bieżącymi",false,2013,686104.21,2283237.5499999998,697224.01,2632856.16,"2013-10-31","2013-10-31"]
[2013,"Uchwała z 31.10.2013r.","BRZEZINY",1021011,1,null,720,"12.2.1.1",null,"    - w tym środki określone w art. 5 ust. 1 pkt 2 ustawy wynikające wyłącznie z zawartych umów na realizację programu, projektu lub zadania",false,2013,0,0,0,0,"2013-10-31","2013-10-31"]
[2013,"Uchwała z 31.10.2013r.","BRZEZINY",1021011,1,null,70,"1.1.4",null,"  z subwencji ogólnej",true,2013,0,0,0,0,"2013-10-31","2013-10-31"]
[2013,"Uchwała z 31.10.2013r.","BRZEZINY",1021011,1,null,50,"1.1.3",null,"  podatki i opłaty",true,2013,0,0,0,0,"2013-10-31","2013-10-31"]
[2013,"Uchwała z 31.10.2013r.","BRZEZINY",1021011,1,null,130,2.1,null," Wydatki bieżące, w tym:",true,2013,25207681.969999999,26129253.640000001,29218500.440000001,26785030.300000001,"2013-10-31","2013-10-31"]
[2013,"Uchwała z 31.10.2013r.","BRZEZINY",1021011,1,null,180,"2.1.3.1",null,"   w tym odsetki i dyskonto określone w art. 243 ust. 1 ustawy lub art. 169 ust. 1 ufp z 2005 r..",false,2013,464051.55,755389.64,884400,791159.57,"2013-10-31","2013-10-31"]
[2013,"Uchwała z 31.10.2013r.","BRZEZINY",1021011,1,null,510,9.6999999999999993,null," Dopuszczalny wskaźnik spłaty zobowiązań określony w art. 243 ustawy, po uwzględnieniu wyłączeń określonych w art. 36 ustawy z dnia 7 grudnia 2012 r. o zmianie niektórych ustaw w związku z realizacją ustawy budżetowej, obliczony w oparciu o plan 3 kwartałów roku poprzedzającego rok budżetowy",true,2013,0,0,0,0,"2013-10-31","2013-10-31"]
[2013,"Uchwała z 31.10.2013r.","BRZEZINY",1021011,1,null,680,"12.1.1",null,"  -  w tym środki określone w art. 5 ust. 1 pkt 2 ustawy",true,2013,965905.76,0,0,931390.39,"2013-10-31","2013-10-31"]
[2013,"Uchwała z 31.10.2013r.","BRZEZINY",1021011,1,null,40,"1.1.2",null,"  dochody z tytułu udziału we wpływach z podatku dochodowego od osób prawnych",true,2013,0,0,0,0,"2013-10-31","2013-10-31"]
[2013,"Uchwała z 31.10.2013r.","BRZEZINY",1021011,1,null,100,"1.2.1",null,"  ze sprzedaży majątku",true,2013,1337141.05,26005.759999999998,100000,159888.32000000001,"2013-10-31","2013-10-31"]
[2013,"Uchwała z 31.10.2013r.","BRZEZINY",1021011,1,null,200,3,"[1] -[2]","Wynik budżetu",false,2013,-3124459.69,26238.400000000001,-4871540.93,-1946205.92,"2013-10-31","2013-10-31"]
[2013,"Uchwała z 31.10.2013r.","BRZEZINY",1021011,1,null,640,11.5,null," Nowe wydatki inwestycyjne",true,2013,0,0,0,0,"2013-10-31","2013-10-31"]
[2013,"Uchwała z 31.10.2013r.","BRZEZINY",1021011,1,null,650,11.6,null," Wydatki majątkowe w formie dotacji ",true,2013,0,0,0,0,"2013-10-31","2013-10-31"]
[2013,"Uchwała z 31.10.2013r.","BRZEZINY",1021011,1,null,430,8.1999999999999993,"[1.1] + [4.1] + [4.2] - (  [2.1] - [2.1.2]  )"," Różnica między dochodami bieżącymi, powiększonymi o nadwyżkę budżetową określoną w pkt 4.1. i wolne środki określone w pkt 4.2.  a wydatkami bieżącymi, pomniejszonym o wydatki określone w pkt  2.1.2.",false,2013,686104.21,2283237.5499999998,3654017.85,5589650,"2013-10-31","2013-10-31"]
[2013,"Uchwała z 31.10.2013r.","BRZEZINY",1021011,1,null,30,"1.1.1",null,"  dochody z tytułu udziału we wpływach z podatku dochodowego od osób fizycznych",true,2013,0,0,0,0,"2013-10-31","2013-10-31"]
[2013,"Uchwała z 31.10.2013r.","BRZEZINY",1021011,1,null,760,12.4,null," Wydatki majątkowe na programy, projekty lub zadania finansowane z udziałem środków, o których mowa w art. 5 ust. 1 pkt 2 i 3 ustawy",true,2013,0,0,0,0,"2013-10-31","2013-10-31"]
[2013,"Uchwała z 31.10.2013r.","BRZEZINY",1021011,1,null,505,"9.6.1","( [1.1] -  ( [2.1]  - [2.1.2] ) + [1.2.1] ) / [1]"," Wskaźnik jednoroczny",false,2013,6.4299999999999996E-2,7.4300000000000005E-2,2.24E-2,8.1100000000000005E-2,"2013-10-31","2013-10-31"]